Uploaded image for project: 'Jenkins'
  1. Jenkins
  2. JENKINS-13835

E175002 in org.tmatesoft.svn.core.internal.io.dav.http.HTTPConnection.request

    Details

    • Similar Issues:

      Description

      Updating Subversion Plugin to 1.40 caused multiple bugs. Rolling back to 1.39 resulted to complete inability to perform a checkout. CI server is totally unusable now.

      Issue #1
      After updating to Subversion Plugin to 1.40 (from 1.39) this exception started occurring sometimes (various salves, various jobs):

      Checking out a fresh workspace because there's no workspace at C:_JenkinsCI\workspace\XXX
      Cleaning local Directory .
      Checking out http://oursvnserver/svn/svnLatest/.../XXX
      A ...
      ERROR: Failed to check out http://oursvnserver/svn/svnLatest/.../XXX
      org.tmatesoft.svn.core.SVNException: svn: E175002: REPORT /svn/svnLatest/!svn/vcc/default failed
      at org.tmatesoft.svn.core.internal.io.dav.http.HTTPConnection.request(HTTPConnection.java:304)
      at org.tmatesoft.svn.core.internal.io.dav.http.HTTPConnection.request(HTTPConnection.java:289)
      at org.tmatesoft.svn.core.internal.io.dav.http.HTTPConnection.request(HTTPConnection.java:277)
      at org.tmatesoft.svn.core.internal.io.dav.DAVConnection.performHttpRequest(DAVConnection.java:696)
      at org.tmatesoft.svn.core.internal.io.dav.DAVConnection.doReport(DAVConnection.java:328)
      at org.tmatesoft.svn.core.internal.io.dav.DAVRepository.runReport(DAVRepository.java:1289)
      at org.tmatesoft.svn.core.internal.io.dav.DAVRepository.update(DAVRepository.java:837)
      at org.tmatesoft.svn.core.internal.wc2.ng.SvnNgAbstractUpdate.updateInternal(SvnNgAbstractUpdate.java:216)
      at org.tmatesoft.svn.core.internal.wc2.ng.SvnNgAbstractUpdate.update(SvnNgAbstractUpdate.java:100)
      at org.tmatesoft.svn.core.internal.wc2.ng.SvnNgAbstractUpdate.checkout(SvnNgAbstractUpdate.java:756)
      at org.tmatesoft.svn.core.internal.wc2.ng.SvnNgCheckout.run(SvnNgCheckout.java:14)
      at org.tmatesoft.svn.core.internal.wc2.ng.SvnNgCheckout.run(SvnNgCheckout.java:9)
      at org.tmatesoft.svn.core.internal.wc2.ng.SvnNgOperationRunner.run(SvnNgOperationRunner.java:20)
      at org.tmatesoft.svn.core.internal.wc2.SvnOperationRunner.run(SvnOperationRunner.java:20)
      at org.tmatesoft.svn.core.wc2.SvnOperationFactory.run(SvnOperationFactory.java:1221)
      at org.tmatesoft.svn.core.wc2.SvnOperation.run(SvnOperation.java:292)
      at org.tmatesoft.svn.core.wc.SVNUpdateClient.doCheckout(SVNUpdateClient.java:781)
      at hudson.scm.subversion.CheckoutUpdater$1.perform(CheckoutUpdater.java:85)
      at hudson.scm.subversion.WorkspaceUpdater$UpdateTask.delegateTo(WorkspaceUpdater.java:144)
      at hudson.scm.subversion.WorkspaceUpdater$UpdateTask.delegateTo(WorkspaceUpdater.java:152)
      at hudson.scm.subversion.UpdateUpdater$TaskImpl.perform(UpdateUpdater.java:121)
      at hudson.scm.subversion.WorkspaceUpdater$UpdateTask.delegateTo(WorkspaceUpdater.java:144)
      at hudson.scm.SubversionSCM$CheckOutTask.perform(SubversionSCM.java:789)
      at hudson.scm.SubversionSCM$CheckOutTask.invoke(SubversionSCM.java:770)
      at hudson.scm.SubversionSCM$CheckOutTask.invoke(SubversionSCM.java:753)
      at hudson.FilePath$FileCallableWrapper.call(FilePath.java:2154)
      at hudson.remoting.UserRequest.perform(UserRequest.java:118)
      at hudson.remoting.UserRequest.perform(UserRequest.java:48)
      at hudson.remoting.Request$2.run(Request.java:287)
      at hudson.remoting.InterceptingExecutorService$1.call(InterceptingExecutorService.java:72)
      at java.util.concurrent.FutureTask$Sync.innerRun(FutureTask.java:303)
      at java.util.concurrent.FutureTask.run(FutureTask.java:138)
      at java.util.concurrent.ThreadPoolExecutor$Worker.runTask(ThreadPoolExecutor.java:886)
      at java.util.concurrent.ThreadPoolExecutor$Worker.run(ThreadPoolExecutor.java:908)
      at java.lang.Thread.run(Thread.java:662)
      Caused by: svn: E175002: REPORT /svn/svnLatest/!svn/vcc/default failed
      at org.tmatesoft.svn.core.SVNErrorMessage.create(SVNErrorMessage.java:208)
      at org.tmatesoft.svn.core.SVNErrorMessage.create(SVNErrorMessage.java:154)
      at org.tmatesoft.svn.core.SVNErrorMessage.create(SVNErrorMessage.java:97)
      ... 35 more
      FATAL: null
      java.lang.NullPointerException

      Issue #2
      Emulate clean checkout by first deleting unversioned/ignored files, then 'svn update' no longer deletes unversioned files in 1.40.

      Issue #3
      Because of #2 and #3 I've decided to roll back to 1.39. So, I've wiped out all workspaces on all nodes and... 1.39 is no longer able to checkout due to:

      Checking out a fresh workspace because there's no workspace at C:_JenkinsCI\workspace\update_Tools_on_all_nodes
      Cleaning local Directory .
      Checking out http://oursvnserver/svn/svnLatest/Tools
      ERROR: Failed to check out http://oursvnserver/svn/svnLatest/Tools
      org.tmatesoft.svn.core.SVNException: svn: 'C:_JenkinsCI\workspace\update_Tools_on_all_nodes' is not a working copy
      at org.tmatesoft.svn.core.internal.wc.SVNErrorManager.error(SVNErrorManager.java:64)
      at org.tmatesoft.svn.core.internal.wc.admin.SVNAdminAreaFactory.open(SVNAdminAreaFactory.java:197)
      at org.tmatesoft.svn.core.internal.wc.admin.SVNWCAccess.doOpen(SVNWCAccess.java:379)
      at org.tmatesoft.svn.core.internal.wc.admin.SVNWCAccess.open(SVNWCAccess.java:283)
      at org.tmatesoft.svn.core.internal.wc.admin.SVNWCAccess.open(SVNWCAccess.java:276)
      at org.tmatesoft.svn.core.internal.wc.admin.SVNWCAccess.openAnchor(SVNWCAccess.java:171)
      at org.tmatesoft.svn.core.wc.SVNUpdateClient.update(SVNUpdateClient.java:512)
      at org.tmatesoft.svn.core.wc.SVNUpdateClient.doCheckout(SVNUpdateClient.java:942)
      at hudson.scm.subversion.CheckoutUpdater$1.perform(CheckoutUpdater.java:84)
      at hudson.scm.subversion.WorkspaceUpdater$UpdateTask.delegateTo(WorkspaceUpdater.java:136)
      at hudson.scm.subversion.WorkspaceUpdater$UpdateTask.delegateTo(WorkspaceUpdater.java:144)
      at hudson.scm.subversion.UpdateUpdater$TaskImpl.perform(UpdateUpdater.java:121)
      at hudson.scm.subversion.WorkspaceUpdater$UpdateTask.delegateTo(WorkspaceUpdater.java:136)
      at hudson.scm.SubversionSCM$CheckOutTask.perform(SubversionSCM.java:788)
      at hudson.scm.SubversionSCM$CheckOutTask.invoke(SubversionSCM.java:769)
      at hudson.scm.SubversionSCM$CheckOutTask.invoke(SubversionSCM.java:753)
      at hudson.FilePath$FileCallableWrapper.call(FilePath.java:2154)
      at hudson.remoting.UserRequest.perform(UserRequest.java:118)
      at hudson.remoting.UserRequest.perform(UserRequest.java:48)
      at hudson.remoting.Request$2.run(Request.java:287)
      at hudson.remoting.InterceptingExecutorService$1.call(InterceptingExecutorService.java:72)
      at java.util.concurrent.FutureTask$Sync.innerRun(FutureTask.java:303)
      at java.util.concurrent.FutureTask.run(FutureTask.java:138)
      at java.util.concurrent.ThreadPoolExecutor$Worker.runTask(ThreadPoolExecutor.java:886)
      at java.util.concurrent.ThreadPoolExecutor$Worker.run(ThreadPoolExecutor.java:908)
      at java.lang.Thread.run(Thread.java:662)
      Caused by: org.tmatesoft.svn.core.SVNErrorMessage: svn: 'C:_JenkinsCI\workspace\update_Tools_on_all_nodes' is not a working copy
      at org.tmatesoft.svn.core.SVNErrorMessage.create(SVNErrorMessage.java:163)
      at org.tmatesoft.svn.core.SVNErrorMessage.create(SVNErrorMessage.java:118)
      at org.tmatesoft.svn.core.internal.wc.admin.SVNAdminAreaFactory.open(SVNAdminAreaFactory.java:192)
      ... 24 more
      FATAL: null
      java.lang.NullPointerException
      at java.util.ArrayList.addAll(Unknown Source)
      at hudson.scm.SubversionSCM.checkout(SubversionSCM.java:743)
      at hudson.scm.SubversionSCM.checkout(SubversionSCM.java:685)
      at hudson.model.AbstractProject.checkout(AbstractProject.java:1218)
      at hudson.model.AbstractBuild$AbstractRunner.checkout(AbstractBuild.java:581)
      at hudson.model.AbstractBuild$AbstractRunner.run(AbstractBuild.java:470)
      at hudson.model.Run.run(Run.java:1421)
      at hudson.matrix.MatrixBuild.run(MatrixBuild.java:248)
      at hudson.model.ResourceController.execute(ResourceController.java:88)
      at hudson.model.Executor.run(Executor.java:238)
      at hudson.model.OneOffExecutor.run(OneOffExecutor.java:66)

      Needless to say that 'C:_JenkinsCI\workspace\update_Tools_on_all_nodes' didn't even exist before checkout.
      This happens on both slave and master.

        Attachments

          Issue Links

            Activity

            pancake pancake created issue -
            pancake pancake made changes -
            Field Original Value New Value
            Environment Jenkins ver. 1.460; Subversion Plugin 1.40, 1.39; Windows Server 2003 R2 x64 SP2 Jenkins ver. 1.460; Subversion Plugin ver. 1.40, 1.39; Windows Server 2003 R2 x64 SP2; Subversion server ver. 1.6.16.
            Hide
            pancake pancake added a comment -

            Found workaround for Issue #3: set svn wc format to 1.6 in Jenkins configuration.
            After downgrading Subversion Plugin value "1.4" was shown for svn wc format on Jenkins configuration page.
            Note I've set it to 1.7 after uprading to Subversion Plugin ver. 1.40.
            I.e. either actual value "1.7" of wc format was rendered (and treated) incorrectly or Subversion Plugin ver. 1.39 can't work with wc format 1.4.

            I'm now decreasing issue priority to "blocker" -> "major" since our CI server can function properly due to the workaround. The issues #1 and #2 still prevent us from upgrading to Subversion Plugin ver. 1.40.

            Show
            pancake pancake added a comment - Found workaround for Issue #3 : set svn wc format to 1.6 in Jenkins configuration. After downgrading Subversion Plugin value "1.4" was shown for svn wc format on Jenkins configuration page. Note I've set it to 1.7 after uprading to Subversion Plugin ver. 1.40. I.e. either actual value "1.7" of wc format was rendered (and treated) incorrectly or Subversion Plugin ver. 1.39 can't work with wc format 1.4. I'm now decreasing issue priority to "blocker" -> "major" since our CI server can function properly due to the workaround. The issues #1 and #2 still prevent us from upgrading to Subversion Plugin ver. 1.40.
            pancake pancake made changes -
            Priority Blocker [ 1 ] Major [ 3 ]
            simabeis Marcel Beister made changes -
            Link This issue is related to JENKINS-13844 [ JENKINS-13844 ]
            christophem christopheM made changes -
            Link This issue is related to JENKINS-13913 [ JENKINS-13913 ]
            Hide
            aristedes aristedes added a comment -

            I can report a very similar issue. The Subversion 1.7.4 server. 1.40 svn jenkins plugin. Pre-existing 1.6 workspace, and Jenkins set to use a 1.7 checkout format. The problem goes away if you choose 1.6 as the workspace format.

            
            ERROR: Failed to update https://acme.com/ish/angel/trunk
            org.tmatesoft.svn.core.SVNException: svn: E175002: REPORT /ish/!svn/vcc/default failed
            	at org.tmatesoft.svn.core.internal.io.dav.http.HTTPConnection.request(HTTPConnection.java:304)
            	at org.tmatesoft.svn.core.internal.io.dav.http.HTTPConnection.request(HTTPConnection.java:289)
            	at org.tmatesoft.svn.core.internal.io.dav.http.HTTPConnection.request(HTTPConnection.java:277)
            	at org.tmatesoft.svn.core.internal.io.dav.DAVConnection.performHttpRequest(DAVConnection.java:696)
            	at org.tmatesoft.svn.core.internal.io.dav.DAVConnection.doReport(DAVConnection.java:328)
            	at org.tmatesoft.svn.core.internal.io.dav.DAVRepository.runReport(DAVRepository.java:1289)
            	at org.tmatesoft.svn.core.internal.io.dav.DAVRepository.update(DAVRepository.java:837)
            	at org.tmatesoft.svn.core.internal.wc16.SVNUpdateClient16.update(SVNUpdateClient16.java:557)
            	at org.tmatesoft.svn.core.internal.wc16.SVNUpdateClient16.doUpdate(SVNUpdateClient16.java:414)
            	at org.tmatesoft.svn.core.internal.wc16.SVNUpdateClient16.doUpdate(SVNUpdateClient16.java:324)
            	at org.tmatesoft.svn.core.internal.wc2.old.SvnOldUpdate.run(SvnOldUpdate.java:27)
            	at org.tmatesoft.svn.core.internal.wc2.old.SvnOldUpdate.run(SvnOldUpdate.java:11)
            	at org.tmatesoft.svn.core.internal.wc2.SvnOperationRunner.run(SvnOperationRunner.java:20)
            	at org.tmatesoft.svn.core.wc2.SvnOperationFactory.run(SvnOperationFactory.java:1221)
            	at org.tmatesoft.svn.core.wc2.SvnOperation.run(SvnOperation.java:292)
            	at org.tmatesoft.svn.core.wc.SVNUpdateClient.doUpdate(SVNUpdateClient.java:315)
            	at org.tmatesoft.svn.core.wc.SVNUpdateClient.doUpdate(SVNUpdateClient.java:295)
            	at org.tmatesoft.svn.core.wc.SVNUpdateClient.doUpdate(SVNUpdateClient.java:391)
            	at hudson.scm.subversion.UpdateUpdater$TaskImpl.perform(UpdateUpdater.java:136)
            	at hudson.scm.subversion.WorkspaceUpdater$UpdateTask.delegateTo(WorkspaceUpdater.java:144)
            	at hudson.scm.SubversionSCM$CheckOutTask.perform(SubversionSCM.java:789)
            	at hudson.scm.SubversionSCM$CheckOutTask.invoke(SubversionSCM.java:770)
            	at hudson.scm.SubversionSCM$CheckOutTask.invoke(SubversionSCM.java:753)
            	at hudson.FilePath$FileCallableWrapper.call(FilePath.java:2154)
            	at hudson.remoting.UserRequest.perform(UserRequest.java:118)
            	at hudson.remoting.UserRequest.perform(UserRequest.java:48)
            	at hudson.remoting.Request$2.run(Request.java:287)
            	at hudson.remoting.InterceptingExecutorService$1.call(InterceptingExecutorService.java:72)
            	at java.util.concurrent.FutureTask$Sync.innerRun(FutureTask.java:303)
            	at java.util.concurrent.FutureTask.run(FutureTask.java:138)
            	at java.util.concurrent.ThreadPoolExecutor$Worker.runTask(ThreadPoolExecutor.java:886)
            	at java.util.concurrent.ThreadPoolExecutor$Worker.run(ThreadPoolExecutor.java:908)
            	at java.lang.Thread.run(Thread.java:680)
            Caused by: svn: E175002: REPORT /ish/!svn/vcc/default failed
            	at org.tmatesoft.svn.core.SVNErrorMessage.create(SVNErrorMessage.java:208)
            	at org.tmatesoft.svn.core.SVNErrorMessage.create(SVNErrorMessage.java:154)
            	at org.tmatesoft.svn.core.SVNErrorMessage.create(SVNErrorMessage.java:97)
            	... 33 more
            
            

            Looks like it tries to upgrade the workspace and fails.

            Show
            aristedes aristedes added a comment - I can report a very similar issue. The Subversion 1.7.4 server. 1.40 svn jenkins plugin. Pre-existing 1.6 workspace, and Jenkins set to use a 1.7 checkout format. The problem goes away if you choose 1.6 as the workspace format. ERROR: Failed to update https: //acme.com/ish/angel/trunk org.tmatesoft.svn.core.SVNException: svn: E175002: REPORT /ish/!svn/vcc/ default failed at org.tmatesoft.svn.core.internal.io.dav.http.HTTPConnection.request(HTTPConnection.java:304) at org.tmatesoft.svn.core.internal.io.dav.http.HTTPConnection.request(HTTPConnection.java:289) at org.tmatesoft.svn.core.internal.io.dav.http.HTTPConnection.request(HTTPConnection.java:277) at org.tmatesoft.svn.core.internal.io.dav.DAVConnection.performHttpRequest(DAVConnection.java:696) at org.tmatesoft.svn.core.internal.io.dav.DAVConnection.doReport(DAVConnection.java:328) at org.tmatesoft.svn.core.internal.io.dav.DAVRepository.runReport(DAVRepository.java:1289) at org.tmatesoft.svn.core.internal.io.dav.DAVRepository.update(DAVRepository.java:837) at org.tmatesoft.svn.core.internal.wc16.SVNUpdateClient16.update(SVNUpdateClient16.java:557) at org.tmatesoft.svn.core.internal.wc16.SVNUpdateClient16.doUpdate(SVNUpdateClient16.java:414) at org.tmatesoft.svn.core.internal.wc16.SVNUpdateClient16.doUpdate(SVNUpdateClient16.java:324) at org.tmatesoft.svn.core.internal.wc2.old.SvnOldUpdate.run(SvnOldUpdate.java:27) at org.tmatesoft.svn.core.internal.wc2.old.SvnOldUpdate.run(SvnOldUpdate.java:11) at org.tmatesoft.svn.core.internal.wc2.SvnOperationRunner.run(SvnOperationRunner.java:20) at org.tmatesoft.svn.core.wc2.SvnOperationFactory.run(SvnOperationFactory.java:1221) at org.tmatesoft.svn.core.wc2.SvnOperation.run(SvnOperation.java:292) at org.tmatesoft.svn.core.wc.SVNUpdateClient.doUpdate(SVNUpdateClient.java:315) at org.tmatesoft.svn.core.wc.SVNUpdateClient.doUpdate(SVNUpdateClient.java:295) at org.tmatesoft.svn.core.wc.SVNUpdateClient.doUpdate(SVNUpdateClient.java:391) at hudson.scm.subversion.UpdateUpdater$TaskImpl.perform(UpdateUpdater.java:136) at hudson.scm.subversion.WorkspaceUpdater$UpdateTask.delegateTo(WorkspaceUpdater.java:144) at hudson.scm.SubversionSCM$CheckOutTask.perform(SubversionSCM.java:789) at hudson.scm.SubversionSCM$CheckOutTask.invoke(SubversionSCM.java:770) at hudson.scm.SubversionSCM$CheckOutTask.invoke(SubversionSCM.java:753) at hudson.FilePath$FileCallableWrapper.call(FilePath.java:2154) at hudson.remoting.UserRequest.perform(UserRequest.java:118) at hudson.remoting.UserRequest.perform(UserRequest.java:48) at hudson.remoting.Request$2.run(Request.java:287) at hudson.remoting.InterceptingExecutorService$1.call(InterceptingExecutorService.java:72) at java.util.concurrent.FutureTask$Sync.innerRun(FutureTask.java:303) at java.util.concurrent.FutureTask.run(FutureTask.java:138) at java.util.concurrent.ThreadPoolExecutor$Worker.runTask(ThreadPoolExecutor.java:886) at java.util.concurrent.ThreadPoolExecutor$Worker.run(ThreadPoolExecutor.java:908) at java.lang. Thread .run( Thread .java:680) Caused by: svn: E175002: REPORT /ish/!svn/vcc/ default failed at org.tmatesoft.svn.core.SVNErrorMessage.create(SVNErrorMessage.java:208) at org.tmatesoft.svn.core.SVNErrorMessage.create(SVNErrorMessage.java:154) at org.tmatesoft.svn.core.SVNErrorMessage.create(SVNErrorMessage.java:97) ... 33 more Looks like it tries to upgrade the workspace and fails.
            Hide
            nicoulaj Julien Nicoulaud added a comment -

            Same here with existing repositories in 1.5 format.

            Show
            nicoulaj Julien Nicoulaud added a comment - Same here with existing repositories in 1.5 format.
            Hide
            stephenconnolly Stephen Connolly added a comment -

            This looks to be an encoding issue with your log messages on your subversion server.

            Log messages have always been required to be UTF-8. Only recent releases of Subversion started enforcing it better at all layers. The SVN command line client always handled this, but the lower level API's (and I suspect the SVNKit library that Jenkins uses) did not so if you used a different client (i.e. committing from TortoiseSVN or eclipse, etc) it was possible to get non-UTF-8 data into the repository.

            You can use svnsync from SVN 1.7 to synch the existing repository to a new repository using the --source-prop-encoding ARG option. This will convert the existing revprops from the specified encoding to UTF-8 as part of synching to a new repository. When the process is done, you can switch in the new repository for the old one to fix your repository.

            Show
            stephenconnolly Stephen Connolly added a comment - This looks to be an encoding issue with your log messages on your subversion server. Log messages have always been required to be UTF-8. Only recent releases of Subversion started enforcing it better at all layers. The SVN command line client always handled this, but the lower level API's (and I suspect the SVNKit library that Jenkins uses) did not so if you used a different client (i.e. committing from TortoiseSVN or eclipse, etc) it was possible to get non-UTF-8 data into the repository. You can use svnsync from SVN 1.7 to synch the existing repository to a new repository using the --source-prop-encoding ARG option. This will convert the existing revprops from the specified encoding to UTF-8 as part of synching to a new repository. When the process is done, you can switch in the new repository for the old one to fix your repository.
            Hide
            lrkwz Luca Orlandi added a comment - - edited

            Same issue here.
            I've also downgraded to jenkins 1.464 and subversion plugin 1.34 with NO SUCCESS at all.
            I cannot upgrade the server format as suggested by @stephenconnolly comment because of a very large 1.6 repository

            It's urgent for me to find a robust workaround (maybe something on apache encoding?).

            Show
            lrkwz Luca Orlandi added a comment - - edited Same issue here. I've also downgraded to jenkins 1.464 and subversion plugin 1.34 with NO SUCCESS at all. I cannot upgrade the server format as suggested by @stephenconnolly comment because of a very large 1.6 repository It's urgent for me to find a robust workaround (maybe something on apache encoding?).
            lrkwz Luca Orlandi made changes -
            Labels plugin subversion windows linux plugin subversion windows
            Hide
            pancake pancake added a comment -

            stephenconnolly, E175002 doesn't seem to be related to server encoding issue. The bug occurred totally sporadically, i.e. didn't always reproduce for the same job (hence the same repo URL). In case that was caused by something wrong with repository, it should have been always reproducible for the same URL, right?

            Luca, there is a workaround for "not a working copy" issue: go to Jenkins configuration and change WC format to 1.6. And E175002 never reproduced for me after downgrading 1.40 -> 1.39.

            Show
            pancake pancake added a comment - stephenconnolly , E175002 doesn't seem to be related to server encoding issue. The bug occurred totally sporadically, i.e. didn't always reproduce for the same job (hence the same repo URL). In case that was caused by something wrong with repository, it should have been always reproducible for the same URL, right? Luca , there is a workaround for "not a working copy" issue: go to Jenkins configuration and change WC format to 1.6. And E175002 never reproduced for me after downgrading 1.40 -> 1.39.
            Hide
            simabeis Marcel Beister added a comment -

            I must admit that I'm currently a bit pissed about the 1.40 release of the subversion plugin.

            This version introduced several severe issues (emulate cleanup not working, svn-externals not working properly) which should have been detected before the release! But that's not my point... I'm really disappointed on how these problems are dealt with (or NOT dealt with!) after the buggy version has been release. Since 3 weeks nothing has happened and the buggy version is still delivered to all jenkins users!

            Show
            simabeis Marcel Beister added a comment - I must admit that I'm currently a bit pissed about the 1.40 release of the subversion plugin. This version introduced several severe issues (emulate cleanup not working, svn-externals not working properly) which should have been detected before the release! But that's not my point... I'm really disappointed on how these problems are dealt with (or NOT dealt with!) after the buggy version has been release. Since 3 weeks nothing has happened and the buggy version is still delivered to all jenkins users!
            Hide
            aristedes aristedes added a comment - - edited

            @stephenconnolly I don't know if you are right about your hunch that encoding is the source of all these issues. I've been able to upgrade the Jenkins workspace using the command line svn tool without any trouble.

            Given the trouble that svnkit has been (bugs, slow update cycle), is there any possibility that this plugin could use the command line svn binary just like the git jenkins plugin does? Yes, I know that is slightly more work for users who then need to ensure it is installed and the path correct, but vastly less work for the developers of the plugin to keep up with.

            Show
            aristedes aristedes added a comment - - edited @stephenconnolly I don't know if you are right about your hunch that encoding is the source of all these issues. I've been able to upgrade the Jenkins workspace using the command line svn tool without any trouble. Given the trouble that svnkit has been (bugs, slow update cycle), is there any possibility that this plugin could use the command line svn binary just like the git jenkins plugin does? Yes, I know that is slightly more work for users who then need to ensure it is installed and the path correct, but vastly less work for the developers of the plugin to keep up with.
            Hide
            fridodev Federico Paolantoni added a comment -

            Configuration:

            Jenkins Subversion Plug-in 1.40
            Jenkins ver. 1.447.1 running on Red Hat Enterprise Linux Server release 5.5 (Tikanga) kernel 2.6.18-194.el5.
            java version "1.6.0_30"
            Java(TM) SE Runtime Environment (build 1.6.0_30-b12)

            SVN server Powered by Subversion version 1.4.0 (r21228).

            exception:
            org.tmatesoft.svn.core.SVNException: svn: E175002: OPTIONS /repos/operations/trunk failed
            at org.tmatesoft.svn.core.internal.io.dav.http.HTTPConnection.request(HTTPConnection.java:304)
            at org.tmatesoft.svn.core.internal.io.dav.http.HTTPConnection.request(HTTPConnection.java:289)
            at org.tmatesoft.svn.core.internal.io.dav.http.HTTPConnection.request(HTTPConnection.java:277)
            at org.tmatesoft.svn.core.internal.io.dav.DAVConnection.performHttpRequest(DAVConnection.java:696)
            at org.tmatesoft.svn.core.internal.io.dav.DAVConnection.exchangeCapabilities(DAVConnection.java:619)
            at org.tmatesoft.svn.core.internal.io.dav.DAVConnection.open(DAVConnection.java:103)
            at org.tmatesoft.svn.core.internal.io.dav.DAVRepository.openConnection(DAVRepository.java:1018)
            at org.tmatesoft.svn.core.internal.io.dav.DAVRepository.getLatestRevision(DAVRepository.java:180)
            at org.tmatesoft.svn.core.internal.wc16.SVNBasicDelegate.getRevisionNumber(SVNBasicDelegate.java:480)
            at org.tmatesoft.svn.core.internal.wc16.SVNBasicDelegate.getLocations(SVNBasicDelegate.java:833)
            at org.tmatesoft.svn.core.internal.wc16.SVNBasicDelegate.createRepository(SVNBasicDelegate.java:527)
            at org.tmatesoft.svn.core.internal.wc16.SVNUpdateClient16.doCheckout(SVNUpdateClient16.java:925)
            at org.tmatesoft.svn.core.internal.wc2.old.SvnOldCheckout.run(SvnOldCheckout.java:19)
            at org.tmatesoft.svn.core.internal.wc2.old.SvnOldCheckout.run(SvnOldCheckout.java:8)
            at org.tmatesoft.svn.core.internal.wc2.SvnOperationRunner.run(SvnOperationRunner.java:20)
            at org.tmatesoft.svn.core.wc2.SvnOperationFactory.run(SvnOperationFactory.java:1221)
            at org.tmatesoft.svn.core.wc2.SvnOperation.run(SvnOperation.java:292)
            at org.tmatesoft.svn.core.wc.SVNUpdateClient.doCheckout(SVNUpdateClient.java:781)
            at hudson.scm.subversion.CheckoutUpdater$1.perform(CheckoutUpdater.java:85)
            at hudson.scm.subversion.WorkspaceUpdater$UpdateTask.delegateTo(WorkspaceUpdater.java:144)
            at hudson.scm.subversion.WorkspaceUpdater$UpdateTask.delegateTo(WorkspaceUpdater.java:152)
            at hudson.scm.subversion.UpdateUpdater$TaskImpl.perform(UpdateUpdater.java:121)
            at hudson.scm.subversion.WorkspaceUpdater$UpdateTask.delegateTo(WorkspaceUpdater.java:144)
            at hudson.scm.SubversionSCM$CheckOutTask.perform(SubversionSCM.java:789)
            at hudson.scm.SubversionSCM$CheckOutTask.invoke(SubversionSCM.java:770)
            at hudson.scm.SubversionSCM$CheckOutTask.invoke(SubversionSCM.java:753)
            at hudson.FilePath.act(FilePath.java:784)
            at hudson.FilePath.act(FilePath.java:766)
            at hudson.scm.SubversionSCM.checkout(SubversionSCM.java:743)
            at hudson.scm.SubversionSCM.checkout(SubversionSCM.java:685)
            at hudson.model.AbstractProject.checkout(AbstractProject.java:1195)
            at hudson.model.AbstractBuild$AbstractRunner.checkout(AbstractBuild.java:573)
            at hudson.model.AbstractBuild$AbstractRunner.run(AbstractBuild.java:462)
            at hudson.model.Run.run(Run.java:1404)
            at hudson.model.FreeStyleBuild.run(FreeStyleBuild.java:46)
            at hudson.model.ResourceController.execute(ResourceController.java:88)
            at hudson.model.Executor.run(Executor.java:238)
            Caused by: svn: E175002: OPTIONS /repos/operations/trunk failed
            at org.tmatesoft.svn.core.SVNErrorMessage.create(SVNErrorMessage.java:208)
            at org.tmatesoft.svn.core.SVNErrorMessage.create(SVNErrorMessage.java:154)
            at org.tmatesoft.svn.core.SVNErrorMessage.create(SVNErrorMessage.java:97)
            ... 37 more
            FATAL: null
            java.lang.NullPointerException
            at java.util.ArrayList.addAll(ArrayList.java:472)
            at hudson.scm.SubversionSCM.checkout(SubversionSCM.java:743)
            at hudson.scm.SubversionSCM.checkout(SubversionSCM.java:685)
            at hudson.model.AbstractProject.checkout(AbstractProject.java:1195)
            at hudson.model.AbstractBuild$AbstractRunner.checkout(AbstractBuild.java:573)
            at hudson.model.AbstractBuild$AbstractRunner.run(AbstractBuild.java:462)
            at hudson.model.Run.run(Run.java:1404)
            at hudson.model.FreeStyleBuild.run(FreeStyleBuild.java:46)
            at hudson.model.ResourceController.execute(ResourceController.java:88)
            at hudson.model.Executor.run(Executor.java:238)

            Should I rollback to previous plugin version?

            Show
            fridodev Federico Paolantoni added a comment - Configuration: Jenkins Subversion Plug-in 1.40 Jenkins ver. 1.447.1 running on Red Hat Enterprise Linux Server release 5.5 (Tikanga) kernel 2.6.18-194.el5. java version "1.6.0_30" Java(TM) SE Runtime Environment (build 1.6.0_30-b12) SVN server Powered by Subversion version 1.4.0 (r21228). exception: org.tmatesoft.svn.core.SVNException: svn: E175002: OPTIONS /repos/operations/trunk failed at org.tmatesoft.svn.core.internal.io.dav.http.HTTPConnection.request(HTTPConnection.java:304) at org.tmatesoft.svn.core.internal.io.dav.http.HTTPConnection.request(HTTPConnection.java:289) at org.tmatesoft.svn.core.internal.io.dav.http.HTTPConnection.request(HTTPConnection.java:277) at org.tmatesoft.svn.core.internal.io.dav.DAVConnection.performHttpRequest(DAVConnection.java:696) at org.tmatesoft.svn.core.internal.io.dav.DAVConnection.exchangeCapabilities(DAVConnection.java:619) at org.tmatesoft.svn.core.internal.io.dav.DAVConnection.open(DAVConnection.java:103) at org.tmatesoft.svn.core.internal.io.dav.DAVRepository.openConnection(DAVRepository.java:1018) at org.tmatesoft.svn.core.internal.io.dav.DAVRepository.getLatestRevision(DAVRepository.java:180) at org.tmatesoft.svn.core.internal.wc16.SVNBasicDelegate.getRevisionNumber(SVNBasicDelegate.java:480) at org.tmatesoft.svn.core.internal.wc16.SVNBasicDelegate.getLocations(SVNBasicDelegate.java:833) at org.tmatesoft.svn.core.internal.wc16.SVNBasicDelegate.createRepository(SVNBasicDelegate.java:527) at org.tmatesoft.svn.core.internal.wc16.SVNUpdateClient16.doCheckout(SVNUpdateClient16.java:925) at org.tmatesoft.svn.core.internal.wc2.old.SvnOldCheckout.run(SvnOldCheckout.java:19) at org.tmatesoft.svn.core.internal.wc2.old.SvnOldCheckout.run(SvnOldCheckout.java:8) at org.tmatesoft.svn.core.internal.wc2.SvnOperationRunner.run(SvnOperationRunner.java:20) at org.tmatesoft.svn.core.wc2.SvnOperationFactory.run(SvnOperationFactory.java:1221) at org.tmatesoft.svn.core.wc2.SvnOperation.run(SvnOperation.java:292) at org.tmatesoft.svn.core.wc.SVNUpdateClient.doCheckout(SVNUpdateClient.java:781) at hudson.scm.subversion.CheckoutUpdater$1.perform(CheckoutUpdater.java:85) at hudson.scm.subversion.WorkspaceUpdater$UpdateTask.delegateTo(WorkspaceUpdater.java:144) at hudson.scm.subversion.WorkspaceUpdater$UpdateTask.delegateTo(WorkspaceUpdater.java:152) at hudson.scm.subversion.UpdateUpdater$TaskImpl.perform(UpdateUpdater.java:121) at hudson.scm.subversion.WorkspaceUpdater$UpdateTask.delegateTo(WorkspaceUpdater.java:144) at hudson.scm.SubversionSCM$CheckOutTask.perform(SubversionSCM.java:789) at hudson.scm.SubversionSCM$CheckOutTask.invoke(SubversionSCM.java:770) at hudson.scm.SubversionSCM$CheckOutTask.invoke(SubversionSCM.java:753) at hudson.FilePath.act(FilePath.java:784) at hudson.FilePath.act(FilePath.java:766) at hudson.scm.SubversionSCM.checkout(SubversionSCM.java:743) at hudson.scm.SubversionSCM.checkout(SubversionSCM.java:685) at hudson.model.AbstractProject.checkout(AbstractProject.java:1195) at hudson.model.AbstractBuild$AbstractRunner.checkout(AbstractBuild.java:573) at hudson.model.AbstractBuild$AbstractRunner.run(AbstractBuild.java:462) at hudson.model.Run.run(Run.java:1404) at hudson.model.FreeStyleBuild.run(FreeStyleBuild.java:46) at hudson.model.ResourceController.execute(ResourceController.java:88) at hudson.model.Executor.run(Executor.java:238) Caused by: svn: E175002: OPTIONS /repos/operations/trunk failed at org.tmatesoft.svn.core.SVNErrorMessage.create(SVNErrorMessage.java:208) at org.tmatesoft.svn.core.SVNErrorMessage.create(SVNErrorMessage.java:154) at org.tmatesoft.svn.core.SVNErrorMessage.create(SVNErrorMessage.java:97) ... 37 more FATAL: null java.lang.NullPointerException at java.util.ArrayList.addAll(ArrayList.java:472) at hudson.scm.SubversionSCM.checkout(SubversionSCM.java:743) at hudson.scm.SubversionSCM.checkout(SubversionSCM.java:685) at hudson.model.AbstractProject.checkout(AbstractProject.java:1195) at hudson.model.AbstractBuild$AbstractRunner.checkout(AbstractBuild.java:573) at hudson.model.AbstractBuild$AbstractRunner.run(AbstractBuild.java:462) at hudson.model.Run.run(Run.java:1404) at hudson.model.FreeStyleBuild.run(FreeStyleBuild.java:46) at hudson.model.ResourceController.execute(ResourceController.java:88) at hudson.model.Executor.run(Executor.java:238) Should I rollback to previous plugin version?
            Hide
            johankees Johan-Kees Vliek added a comment -

            Hi,
            We have the same issue. This only seems to appear on Windows and not on Linux (as far as I can see).
            We use SVN 1.6, Jenkins 1.470 and SVN Plugin v1.40.
            We noticed that only new Jobs are affected. Existing jobs are not affected.
            Plz resolve this issue a.s.a.p. or advice on what to do. Many thanks!!!

            Regards,
            Johan-Kees

            Show
            johankees Johan-Kees Vliek added a comment - Hi, We have the same issue. This only seems to appear on Windows and not on Linux (as far as I can see). We use SVN 1.6, Jenkins 1.470 and SVN Plugin v1.40. We noticed that only new Jobs are affected. Existing jobs are not affected. Plz resolve this issue a.s.a.p. or advice on what to do. Many thanks!!! Regards, Johan-Kees
            Hide
            kohsuke Kohsuke Kawaguchi added a comment -

            With respect to issue #1, new SVNKit 1.7 was dropping the root cause of the exception, which makes it difficult for us to get to the root cause. I fixed this in SVNKit 1.7.4-jenkins-3, which will be a part of Subversion plugin 1.41 that I'll be releasing shortly. So I request those who are seeing this issue to upgrade to 1.41 and report the stack trace, including all the "Caused by ..." sections.

            With respect to issue #2, I couldn't reproduce it. This issue is independent from issue #1, so I request that the submitter (or anyone else seeing the issue) to open a separate ticket, with details, such as the type of the repository you check out from, Subversion server version, and the console output.

            With respect to Issue #3, this was presumably because the user set the workspace format to 1.7, and that was stored in the configuration file, but Subversion 1.39 (that doesn't support 1.7 workspace) didn't recognize this value and failed to gracefully recover from it. We cannot retroactively fix 1.39, but in case similar issue happens in the future, I put a fix in 1.41 to fall back to 1.4.

            These 3 issues are independent issues, and so we'll use this ticket to track the issue #1 portion of the original bug report.

            If people see what's discussed in the issue #2 and #3, please open separate tickets to avoid confusion (but please do post those new ticket IDs so that other people who want to comment on those sub-issues know where to go.)

            Show
            kohsuke Kohsuke Kawaguchi added a comment - With respect to issue #1, new SVNKit 1.7 was dropping the root cause of the exception, which makes it difficult for us to get to the root cause. I fixed this in SVNKit 1.7.4-jenkins-3, which will be a part of Subversion plugin 1.41 that I'll be releasing shortly. So I request those who are seeing this issue to upgrade to 1.41 and report the stack trace, including all the "Caused by ..." sections. With respect to issue #2, I couldn't reproduce it. This issue is independent from issue #1, so I request that the submitter (or anyone else seeing the issue) to open a separate ticket, with details, such as the type of the repository you check out from, Subversion server version, and the console output. With respect to Issue #3, this was presumably because the user set the workspace format to 1.7, and that was stored in the configuration file, but Subversion 1.39 (that doesn't support 1.7 workspace) didn't recognize this value and failed to gracefully recover from it. We cannot retroactively fix 1.39, but in case similar issue happens in the future, I put a fix in 1.41 to fall back to 1.4. These 3 issues are independent issues, and so we'll use this ticket to track the issue #1 portion of the original bug report. If people see what's discussed in the issue #2 and #3, please open separate tickets to avoid confusion (but please do post those new ticket IDs so that other people who want to comment on those sub-issues know where to go.)
            Hide
            kohsuke Kohsuke Kawaguchi added a comment -

            Updated the ticket title to reflect the problem this ticket is tracking.

            Show
            kohsuke Kohsuke Kawaguchi added a comment - Updated the ticket title to reflect the problem this ticket is tracking.
            kohsuke Kohsuke Kawaguchi made changes -
            Summary upgrading Subversion Plugin to 1.40 totally ruined our CI server E175002 in org.tmatesoft.svn.core.internal.io.dav.http.HTTPConnection.request
            Hide
            scm_issue_link SCM/JIRA link daemon added a comment -

            Code changed in jenkins
            User: Kohsuke Kawaguchi
            Path:
            src/main/java/hudson/scm/SubversionWorkspaceSelector.java
            http://jenkins-ci.org/commit/subversion-plugin/6ccdb797100cfde195e67fb30886fe0dcd91568d
            Log:
            JENKINS-13835

            If we couldn't find any matching factory for the designated format, fall back to the known version to keep going.
            This won't help with rolling back to 1.39, but it will help in the future if Subversion 1.8 will introduce yet another workspace format.

            Show
            scm_issue_link SCM/JIRA link daemon added a comment - Code changed in jenkins User: Kohsuke Kawaguchi Path: src/main/java/hudson/scm/SubversionWorkspaceSelector.java http://jenkins-ci.org/commit/subversion-plugin/6ccdb797100cfde195e67fb30886fe0dcd91568d Log: JENKINS-13835 If we couldn't find any matching factory for the designated format, fall back to the known version to keep going. This won't help with rolling back to 1.39, but it will help in the future if Subversion 1.8 will introduce yet another workspace format.
            Hide
            scm_issue_link SCM/JIRA link daemon added a comment -

            Code changed in jenkins
            User: Kohsuke Kawaguchi
            Path:
            pom.xml
            http://jenkins-ci.org/commit/subversion-plugin/ce5578b05fd545966302df9fe9f2b3bfea18c062
            Log:
            JENKINS-13835

            This version of SVNKit doesn't lose the chained exceptions.

            Show
            scm_issue_link SCM/JIRA link daemon added a comment - Code changed in jenkins User: Kohsuke Kawaguchi Path: pom.xml http://jenkins-ci.org/commit/subversion-plugin/ce5578b05fd545966302df9fe9f2b3bfea18c062 Log: JENKINS-13835 This version of SVNKit doesn't lose the chained exceptions.
            aristedes aristedes made changes -
            Link This issue is related to JENKINS-13859 [ JENKINS-13859 ]
            Hide
            kohsuke Kohsuke Kawaguchi added a comment -

            Like I wrote a few comments above, I request those who are seeing this issue to upgrade to 1.41 and report the stack trace, including all the "Caused by ..." sections.

            Show
            kohsuke Kohsuke Kawaguchi added a comment - Like I wrote a few comments above , I request those who are seeing this issue to upgrade to 1.41 and report the stack trace, including all the "Caused by ..." sections.
            Hide
            integer Kanstantsin Shautsou added a comment -

            1.42 1.471, emulate clean workspace, svn server 1.7, settings in jenkins 1.7 svn client:

            Building in workspace /opt/jenkins/workspace/

            {PROJECT}
            Cleaning up /opt/jenkins/workspace/{PROJECT}

            Deleting /opt/jenkins/workspace/

            {PROJECT}
            ----cut---
            Deleting /opt/jenkins/workspace/{PROJECT}

            Updating https://server/

            {PROJECT}/trunk/{CUT}
            ---cut here is some updates and deletes" –
            ERROR: Failed to update https://{server}/{PROJECT}

            org.tmatesoft.svn.core.SVNException: svn: E175002: REPORT /

            {PROJECT}/!svn/vcc/default failed
            at org.tmatesoft.svn.core.internal.io.dav.http.HTTPConnection.request(HTTPConnection.java:304)
            at org.tmatesoft.svn.core.internal.io.dav.http.HTTPConnection.request(HTTPConnection.java:289)
            at org.tmatesoft.svn.core.internal.io.dav.http.HTTPConnection.request(HTTPConnection.java:277)
            at org.tmatesoft.svn.core.internal.io.dav.DAVConnection.performHttpRequest(DAVConnection.java:696)
            at org.tmatesoft.svn.core.internal.io.dav.DAVConnection.doReport(DAVConnection.java:328)
            at org.tmatesoft.svn.core.internal.io.dav.DAVRepository.runReport(DAVRepository.java:1289)
            at org.tmatesoft.svn.core.internal.io.dav.DAVRepository.update(DAVRepository.java:837)
            at org.tmatesoft.svn.core.internal.wc16.SVNUpdateClient16.update(SVNUpdateClient16.java:557)
            at org.tmatesoft.svn.core.internal.wc16.SVNUpdateClient16.doUpdate(SVNUpdateClient16.java:414)
            at org.tmatesoft.svn.core.internal.wc16.SVNUpdateClient16.doUpdate(SVNUpdateClient16.java:324)
            at org.tmatesoft.svn.core.internal.wc2.old.SvnOldUpdate.run(SvnOldUpdate.java:27)
            at org.tmatesoft.svn.core.internal.wc2.old.SvnOldUpdate.run(SvnOldUpdate.java:11)
            at org.tmatesoft.svn.core.internal.wc2.SvnOperationRunner.run(SvnOperationRunner.java:20)
            at org.tmatesoft.svn.core.wc2.SvnOperationFactory.run(SvnOperationFactory.java:1221)
            at org.tmatesoft.svn.core.wc2.SvnOperation.run(SvnOperation.java:292)
            at org.tmatesoft.svn.core.wc.SVNUpdateClient.doUpdate(SVNUpdateClient.java:315)
            at org.tmatesoft.svn.core.wc.SVNUpdateClient.doUpdate(SVNUpdateClient.java:295)
            at org.tmatesoft.svn.core.wc.SVNUpdateClient.doUpdate(SVNUpdateClient.java:391)
            at hudson.scm.subversion.UpdateUpdater$TaskImpl.perform(UpdateUpdater.java:136)
            at hudson.scm.subversion.WorkspaceUpdater$UpdateTask.delegateTo(WorkspaceUpdater.java:144)
            at hudson.scm.SubversionSCM$CheckOutTask.perform(SubversionSCM.java:789)
            at hudson.scm.SubversionSCM$CheckOutTask.invoke(SubversionSCM.java:770)
            at hudson.scm.SubversionSCM$CheckOutTask.invoke(SubversionSCM.java:753)
            at hudson.FilePath.act(FilePath.java:842)
            at hudson.FilePath.act(FilePath.java:824)
            at hudson.scm.SubversionSCM.checkout(SubversionSCM.java:743)
            at hudson.scm.SubversionSCM.checkout(SubversionSCM.java:685)
            at hudson.model.AbstractProject.checkout(AbstractProject.java:1248)
            at hudson.model.AbstractBuild$AbstractBuildExecution.defaultCheckout(AbstractBuild.java:589)
            at jenkins.scm.SCMCheckoutStrategy.checkout(SCMCheckoutStrategy.java:88)
            at hudson.model.AbstractBuild$AbstractBuildExecution.run(AbstractBuild.java:494)
            at hudson.model.Run.execute(Run.java:1484)
            at hudson.maven.MavenModuleSetBuild.run(MavenModuleSetBuild.java:477)
            at hudson.model.ResourceController.execute(ResourceController.java:88)
            at hudson.model.Executor.run(Executor.java:236)
            Caused by: svn: E175002: REPORT /{PROJECT}

            /!svn/vcc/default failed
            at org.tmatesoft.svn.core.SVNErrorMessage.create(SVNErrorMessage.java:208)
            at org.tmatesoft.svn.core.SVNErrorMessage.create(SVNErrorMessage.java:154)
            at org.tmatesoft.svn.core.SVNErrorMessage.create(SVNErrorMessage.java:97)
            ... 35 more
            Caused by: org.tmatesoft.svn.core.SVNException: svn: E155017: REPORT request failed on '/

            {PROJECT}/!svn/vcc/default'
            svn: E155017: Checksum mismatch while updating '/opt/jenkins/workspace/{PROJECT}

            /

            {PATHES}/.svn/text-base/{FILE}.svn-base'; expected: 'b8cd3fbef41277690d56b8d55cfecab1', actual: '2989670c2ac11c55986f7ee420dca5ec'
            at org.tmatesoft.svn.core.internal.wc.SVNErrorManager.error(SVNErrorManager.java:64)
            at org.tmatesoft.svn.core.internal.wc.SVNErrorManager.error(SVNErrorManager.java:51)
            at org.tmatesoft.svn.core.internal.io.dav.http.HTTPConnection._request(HTTPConnection.java:675)
            at org.tmatesoft.svn.core.internal.io.dav.http.HTTPConnection.request(HTTPConnection.java:298)
            ... 34 more
            Caused by: svn: E155017: REPORT request failed on '/{PROJECT}/!svn/vcc/default'
            at org.tmatesoft.svn.core.SVNErrorMessage.create(SVNErrorMessage.java:208)
            at org.tmatesoft.svn.core.SVNErrorMessage.create(SVNErrorMessage.java:154)
            at org.tmatesoft.svn.core.SVNErrorMessage.create(SVNErrorMessage.java:97)
            at org.tmatesoft.svn.core.SVNErrorMessage.wrap(SVNErrorMessage.java:414)
            ... 36 more
            Caused by: svn: E155017: Checksum mismatch while updating '/opt/jenkins/workspace/{PROJECT}/{PATHES}

            /.svn/text-base/

            {FILE}

            .svn-base'; expected: 'b8cd3fbef41277690d56b8d55cfecab1', actual: '2989670c2ac11c55986f7ee420dca5ec'
            at org.tmatesoft.svn.core.SVNErrorMessage.create(SVNErrorMessage.java:208)
            at org.tmatesoft.svn.core.SVNErrorMessage.create(SVNErrorMessage.java:189)
            at org.tmatesoft.svn.core.SVNErrorMessage.create(SVNErrorMessage.java:141)
            at org.tmatesoft.svn.core.internal.wc.SVNUpdateEditor15.textDeltaEnd(SVNUpdateEditor15.java:634)
            at org.tmatesoft.svn.core.internal.wc.SVNAmbientDepthFilterEditor.textDeltaEnd(SVNAmbientDepthFilterEditor.java:221)
            at org.tmatesoft.svn.core.internal.wc.SVNCancellableEditor.textDeltaEnd(SVNCancellableEditor.java:130)
            at org.tmatesoft.svn.core.internal.io.dav.handlers.BasicDAVDeltaHandler.setDeltaProcessing(BasicDAVDeltaHandler.java:41)
            at org.tmatesoft.svn.core.internal.io.dav.handlers.DAVEditorHandler.endElement(DAVEditorHandler.java:548)
            at org.tmatesoft.svn.core.internal.io.dav.handlers.BasicDAVHandler.endElement(BasicDAVHandler.java:103)
            at com.sun.org.apache.xerces.internal.parsers.AbstractSAXParser.endElement(AbstractSAXParser.java:601)
            at com.sun.org.apache.xerces.internal.impl.XMLDocumentFragmentScannerImpl.scanEndElement(XMLDocumentFragmentScannerImpl.java:1782)
            at com.sun.org.apache.xerces.internal.impl.XMLDocumentFragmentScannerImpl$FragmentContentDriver.next(XMLDocumentFragmentScannerImpl.java:2939)
            at com.sun.org.apache.xerces.internal.impl.XMLDocumentScannerImpl.next(XMLDocumentScannerImpl.java:648)
            at com.sun.org.apache.xerces.internal.impl.XMLNSDocumentScannerImpl.next(XMLNSDocumentScannerImpl.java:140)
            at com.sun.org.apache.xerces.internal.impl.XMLDocumentFragmentScannerImpl.scanDocument(XMLDocumentFragmentScannerImpl.java:511)
            at com.sun.org.apache.xerces.internal.parsers.XML11Configuration.parse(XML11Configuration.java:808)
            at com.sun.org.apache.xerces.internal.parsers.XML11Configuration.parse(XML11Configuration.java:737)
            at com.sun.org.apache.xerces.internal.parsers.XMLParser.parse(XMLParser.java:119)
            at com.sun.org.apache.xerces.internal.parsers.AbstractSAXParser.parse(AbstractSAXParser.java:1205)
            at com.sun.org.apache.xerces.internal.jaxp.SAXParserImpl$JAXPSAXParser.parse(SAXParserImpl.java:522)
            at org.tmatesoft.svn.core.internal.io.dav.http.HTTPConnection.readData(HTTPConnection.java:796)
            at org.tmatesoft.svn.core.internal.io.dav.http.HTTPConnection.readData(HTTPConnection.java:761)
            at org.tmatesoft.svn.core.internal.io.dav.http.HTTPRequest.dispatch(HTTPRequest.java:218)
            at org.tmatesoft.svn.core.internal.io.dav.http.HTTPConnection._request(HTTPConnection.java:385)
            ... 35 more

            Show
            integer Kanstantsin Shautsou added a comment - 1.42 1.471, emulate clean workspace, svn server 1.7, settings in jenkins 1.7 svn client: Building in workspace /opt/jenkins/workspace/ {PROJECT} Cleaning up /opt/jenkins/workspace/{PROJECT} Deleting /opt/jenkins/workspace/ {PROJECT} ---- cut --- Deleting /opt/jenkins/workspace/{PROJECT} Updating https://server/ {PROJECT}/trunk/{CUT} ---cut here is some updates and deletes" – ERROR: Failed to update https://{server}/{PROJECT} org.tmatesoft.svn.core.SVNException: svn: E175002: REPORT / {PROJECT}/!svn/vcc/default failed at org.tmatesoft.svn.core.internal.io.dav.http.HTTPConnection.request(HTTPConnection.java:304) at org.tmatesoft.svn.core.internal.io.dav.http.HTTPConnection.request(HTTPConnection.java:289) at org.tmatesoft.svn.core.internal.io.dav.http.HTTPConnection.request(HTTPConnection.java:277) at org.tmatesoft.svn.core.internal.io.dav.DAVConnection.performHttpRequest(DAVConnection.java:696) at org.tmatesoft.svn.core.internal.io.dav.DAVConnection.doReport(DAVConnection.java:328) at org.tmatesoft.svn.core.internal.io.dav.DAVRepository.runReport(DAVRepository.java:1289) at org.tmatesoft.svn.core.internal.io.dav.DAVRepository.update(DAVRepository.java:837) at org.tmatesoft.svn.core.internal.wc16.SVNUpdateClient16.update(SVNUpdateClient16.java:557) at org.tmatesoft.svn.core.internal.wc16.SVNUpdateClient16.doUpdate(SVNUpdateClient16.java:414) at org.tmatesoft.svn.core.internal.wc16.SVNUpdateClient16.doUpdate(SVNUpdateClient16.java:324) at org.tmatesoft.svn.core.internal.wc2.old.SvnOldUpdate.run(SvnOldUpdate.java:27) at org.tmatesoft.svn.core.internal.wc2.old.SvnOldUpdate.run(SvnOldUpdate.java:11) at org.tmatesoft.svn.core.internal.wc2.SvnOperationRunner.run(SvnOperationRunner.java:20) at org.tmatesoft.svn.core.wc2.SvnOperationFactory.run(SvnOperationFactory.java:1221) at org.tmatesoft.svn.core.wc2.SvnOperation.run(SvnOperation.java:292) at org.tmatesoft.svn.core.wc.SVNUpdateClient.doUpdate(SVNUpdateClient.java:315) at org.tmatesoft.svn.core.wc.SVNUpdateClient.doUpdate(SVNUpdateClient.java:295) at org.tmatesoft.svn.core.wc.SVNUpdateClient.doUpdate(SVNUpdateClient.java:391) at hudson.scm.subversion.UpdateUpdater$TaskImpl.perform(UpdateUpdater.java:136) at hudson.scm.subversion.WorkspaceUpdater$UpdateTask.delegateTo(WorkspaceUpdater.java:144) at hudson.scm.SubversionSCM$CheckOutTask.perform(SubversionSCM.java:789) at hudson.scm.SubversionSCM$CheckOutTask.invoke(SubversionSCM.java:770) at hudson.scm.SubversionSCM$CheckOutTask.invoke(SubversionSCM.java:753) at hudson.FilePath.act(FilePath.java:842) at hudson.FilePath.act(FilePath.java:824) at hudson.scm.SubversionSCM.checkout(SubversionSCM.java:743) at hudson.scm.SubversionSCM.checkout(SubversionSCM.java:685) at hudson.model.AbstractProject.checkout(AbstractProject.java:1248) at hudson.model.AbstractBuild$AbstractBuildExecution.defaultCheckout(AbstractBuild.java:589) at jenkins.scm.SCMCheckoutStrategy.checkout(SCMCheckoutStrategy.java:88) at hudson.model.AbstractBuild$AbstractBuildExecution.run(AbstractBuild.java:494) at hudson.model.Run.execute(Run.java:1484) at hudson.maven.MavenModuleSetBuild.run(MavenModuleSetBuild.java:477) at hudson.model.ResourceController.execute(ResourceController.java:88) at hudson.model.Executor.run(Executor.java:236) Caused by: svn: E175002: REPORT /{PROJECT} /!svn/vcc/default failed at org.tmatesoft.svn.core.SVNErrorMessage.create(SVNErrorMessage.java:208) at org.tmatesoft.svn.core.SVNErrorMessage.create(SVNErrorMessage.java:154) at org.tmatesoft.svn.core.SVNErrorMessage.create(SVNErrorMessage.java:97) ... 35 more Caused by: org.tmatesoft.svn.core.SVNException: svn: E155017: REPORT request failed on '/ {PROJECT}/!svn/vcc/default' svn: E155017: Checksum mismatch while updating '/opt/jenkins/workspace/{PROJECT} / {PATHES}/.svn/text-base/{FILE}.svn-base'; expected: 'b8cd3fbef41277690d56b8d55cfecab1', actual: '2989670c2ac11c55986f7ee420dca5ec' at org.tmatesoft.svn.core.internal.wc.SVNErrorManager.error(SVNErrorManager.java:64) at org.tmatesoft.svn.core.internal.wc.SVNErrorManager.error(SVNErrorManager.java:51) at org.tmatesoft.svn.core.internal.io.dav.http.HTTPConnection._request(HTTPConnection.java:675) at org.tmatesoft.svn.core.internal.io.dav.http.HTTPConnection.request(HTTPConnection.java:298) ... 34 more Caused by: svn: E155017: REPORT request failed on '/{PROJECT}/!svn/vcc/default' at org.tmatesoft.svn.core.SVNErrorMessage.create(SVNErrorMessage.java:208) at org.tmatesoft.svn.core.SVNErrorMessage.create(SVNErrorMessage.java:154) at org.tmatesoft.svn.core.SVNErrorMessage.create(SVNErrorMessage.java:97) at org.tmatesoft.svn.core.SVNErrorMessage.wrap(SVNErrorMessage.java:414) ... 36 more Caused by: svn: E155017: Checksum mismatch while updating '/opt/jenkins/workspace/{PROJECT}/{PATHES} /.svn/text-base/ {FILE} .svn-base'; expected: 'b8cd3fbef41277690d56b8d55cfecab1', actual: '2989670c2ac11c55986f7ee420dca5ec' at org.tmatesoft.svn.core.SVNErrorMessage.create(SVNErrorMessage.java:208) at org.tmatesoft.svn.core.SVNErrorMessage.create(SVNErrorMessage.java:189) at org.tmatesoft.svn.core.SVNErrorMessage.create(SVNErrorMessage.java:141) at org.tmatesoft.svn.core.internal.wc.SVNUpdateEditor15.textDeltaEnd(SVNUpdateEditor15.java:634) at org.tmatesoft.svn.core.internal.wc.SVNAmbientDepthFilterEditor.textDeltaEnd(SVNAmbientDepthFilterEditor.java:221) at org.tmatesoft.svn.core.internal.wc.SVNCancellableEditor.textDeltaEnd(SVNCancellableEditor.java:130) at org.tmatesoft.svn.core.internal.io.dav.handlers.BasicDAVDeltaHandler.setDeltaProcessing(BasicDAVDeltaHandler.java:41) at org.tmatesoft.svn.core.internal.io.dav.handlers.DAVEditorHandler.endElement(DAVEditorHandler.java:548) at org.tmatesoft.svn.core.internal.io.dav.handlers.BasicDAVHandler.endElement(BasicDAVHandler.java:103) at com.sun.org.apache.xerces.internal.parsers.AbstractSAXParser.endElement(AbstractSAXParser.java:601) at com.sun.org.apache.xerces.internal.impl.XMLDocumentFragmentScannerImpl.scanEndElement(XMLDocumentFragmentScannerImpl.java:1782) at com.sun.org.apache.xerces.internal.impl.XMLDocumentFragmentScannerImpl$FragmentContentDriver.next(XMLDocumentFragmentScannerImpl.java:2939) at com.sun.org.apache.xerces.internal.impl.XMLDocumentScannerImpl.next(XMLDocumentScannerImpl.java:648) at com.sun.org.apache.xerces.internal.impl.XMLNSDocumentScannerImpl.next(XMLNSDocumentScannerImpl.java:140) at com.sun.org.apache.xerces.internal.impl.XMLDocumentFragmentScannerImpl.scanDocument(XMLDocumentFragmentScannerImpl.java:511) at com.sun.org.apache.xerces.internal.parsers.XML11Configuration.parse(XML11Configuration.java:808) at com.sun.org.apache.xerces.internal.parsers.XML11Configuration.parse(XML11Configuration.java:737) at com.sun.org.apache.xerces.internal.parsers.XMLParser.parse(XMLParser.java:119) at com.sun.org.apache.xerces.internal.parsers.AbstractSAXParser.parse(AbstractSAXParser.java:1205) at com.sun.org.apache.xerces.internal.jaxp.SAXParserImpl$JAXPSAXParser.parse(SAXParserImpl.java:522) at org.tmatesoft.svn.core.internal.io.dav.http.HTTPConnection.readData(HTTPConnection.java:796) at org.tmatesoft.svn.core.internal.io.dav.http.HTTPConnection.readData(HTTPConnection.java:761) at org.tmatesoft.svn.core.internal.io.dav.http.HTTPRequest.dispatch(HTTPRequest.java:218) at org.tmatesoft.svn.core.internal.io.dav.http.HTTPConnection._request(HTTPConnection.java:385) ... 35 more
            Hide
            integer Kanstantsin Shautsou added a comment -

            The other very big problem that job is not fails on svn fail and you can got build with mix of files (wrong and new). Could you implement it?

            Show
            integer Kanstantsin Shautsou added a comment - The other very big problem that job is not fails on svn fail and you can got build with mix of files (wrong and new). Could you implement it?
            Hide
            aristedes aristedes added a comment -

            I found the cause of one of the enormous confusions with this plugin for me. If you have a matrix build, then:

            • on the server (not the slave)
            • at the unguessable path of /jobs/[jobname]/configurations/axis-foo/bar/axis-foo1/bar1/subversion.credentials

            you will find the old cached credentials. In all my testing trying to solve the original problems with svnkit upgrade, I changed the user and reset the password.

            It would have been great if somewhere jenkins would have reported which user it was trying to use. Also, deleting the job from the client, doesn't clear the credentials buried against every axis on the server. Why are they on every axis?

            Show
            aristedes aristedes added a comment - I found the cause of one of the enormous confusions with this plugin for me. If you have a matrix build, then: on the server (not the slave) at the unguessable path of /jobs/ [jobname] /configurations/axis-foo/bar/axis-foo1/bar1/subversion.credentials you will find the old cached credentials. In all my testing trying to solve the original problems with svnkit upgrade, I changed the user and reset the password. It would have been great if somewhere jenkins would have reported which user it was trying to use. Also, deleting the job from the client, doesn't clear the credentials buried against every axis on the server. Why are they on every axis?
            Hide
            integer Kanstantsin Shautsou added a comment -

            i haven't matrix builds

            Show
            integer Kanstantsin Shautsou added a comment - i haven't matrix builds
            Hide
            vwagner Valerie Wagner added a comment -

            Using Subversion plugin 1.42:

            13:17:10 ERROR: Failed to update https://myproject/trunk
            13:17:10 org.tmatesoft.svn.core.SVNException: svn: E175002: REPORT /svn/desertowl/!svn/vcc/default failed
            13:17:10 at org.tmatesoft.svn.core.internal.io.dav.http.HTTPConnection.request(HTTPConnection.java:304)
            13:17:10 at org.tmatesoft.svn.core.internal.io.dav.http.HTTPConnection.request(HTTPConnection.java:289)
            13:17:10 at org.tmatesoft.svn.core.internal.io.dav.http.HTTPConnection.request(HTTPConnection.java:277)
            13:17:10 at org.tmatesoft.svn.core.internal.io.dav.DAVConnection.performHttpRequest(DAVConnection.java:696)
            13:17:10 at org.tmatesoft.svn.core.internal.io.dav.DAVConnection.doReport(DAVConnection.java:328)
            13:17:10 at org.tmatesoft.svn.core.internal.io.dav.DAVRepository.runReport(DAVRepository.java:1289)
            13:17:10 at org.tmatesoft.svn.core.internal.io.dav.DAVRepository.update(DAVRepository.java:837)
            13:17:10 at org.tmatesoft.svn.core.internal.wc16.SVNUpdateClient16.update(SVNUpdateClient16.java:557)
            13:17:10 at org.tmatesoft.svn.core.internal.wc16.SVNUpdateClient16.doUpdate(SVNUpdateClient16.java:414)
            13:17:10 at org.tmatesoft.svn.core.internal.wc16.SVNUpdateClient16.doUpdate(SVNUpdateClient16.java:324)
            13:17:10 at org.tmatesoft.svn.core.internal.wc2.old.SvnOldUpdate.run(SvnOldUpdate.java:27)
            13:17:10 at org.tmatesoft.svn.core.internal.wc2.old.SvnOldUpdate.run(SvnOldUpdate.java:11)
            13:17:10 at org.tmatesoft.svn.core.internal.wc2.SvnOperationRunner.run(SvnOperationRunner.java:20)
            13:17:10 at org.tmatesoft.svn.core.wc2.SvnOperationFactory.run(SvnOperationFactory.java:1221)
            13:17:10 at org.tmatesoft.svn.core.wc2.SvnOperation.run(SvnOperation.java:292)
            13:17:10 at org.tmatesoft.svn.core.wc.SVNUpdateClient.doUpdate(SVNUpdateClient.java:315)
            13:17:10 at org.tmatesoft.svn.core.wc.SVNUpdateClient.doUpdate(SVNUpdateClient.java:295)
            13:17:10 at org.tmatesoft.svn.core.wc.SVNUpdateClient.doUpdate(SVNUpdateClient.java:391)
            13:17:10 at hudson.scm.subversion.UpdateUpdater$TaskImpl.perform(UpdateUpdater.java:136)
            13:17:10 at hudson.scm.subversion.WorkspaceUpdater$UpdateTask.delegateTo(WorkspaceUpdater.java:144)
            13:17:10 at hudson.scm.SubversionSCM$CheckOutTask.perform(SubversionSCM.java:789)
            13:17:10 at hudson.scm.SubversionSCM$CheckOutTask.invoke(SubversionSCM.java:770)
            13:17:10 at hudson.scm.SubversionSCM$CheckOutTask.invoke(SubversionSCM.java:753)
            13:17:10 at hudson.FilePath.act(FilePath.java:842)
            13:17:10 at hudson.FilePath.act(FilePath.java:824)
            13:17:10 at hudson.scm.SubversionSCM.checkout(SubversionSCM.java:743)
            13:17:10 at hudson.scm.SubversionSCM.checkout(SubversionSCM.java:685)
            13:17:10 at hudson.model.AbstractProject.checkout(AbstractProject.java:1248)
            13:17:10 at hudson.model.AbstractBuild$AbstractBuildExecution.defaultCheckout(AbstractBuild.java:589)
            13:17:10 at jenkins.scm.SCMCheckoutStrategy.checkout(SCMCheckoutStrategy.java:88)
            13:17:10 at hudson.model.AbstractBuild$AbstractBuildExecution.run(AbstractBuild.java:494)
            13:17:10 at hudson.model.Run.execute(Run.java:1484)
            13:17:10 at hudson.model.FreeStyleBuild.run(FreeStyleBuild.java:46)
            13:17:10 at hudson.model.ResourceController.execute(ResourceController.java:88)
            13:17:10 at hudson.model.Executor.run(Executor.java:236)
            13:17:10 Caused by: svn: E175002: REPORT /svn/desertowl/!svn/vcc/default failed
            13:17:10 at org.tmatesoft.svn.core.SVNErrorMessage.create(SVNErrorMessage.java:208)
            13:17:10 at org.tmatesoft.svn.core.SVNErrorMessage.create(SVNErrorMessage.java:154)
            13:17:10 at org.tmatesoft.svn.core.SVNErrorMessage.create(SVNErrorMessage.java:97)
            13:17:10 ... 35 more
            13:17:10 Caused by: org.tmatesoft.svn.core.SVNException: svn: E155017: REPORT request failed on '/svn/desertowl/!svn/vcc/default'
            13:17:10 svn: E155017: Checksum mismatch while updating '/jenkins/workspaces/DesertOwl-trunk-continuous-C/sw/scripts/dcopy/systems/lab-mp-dev/GROUND/ds/usr_local_bin/.svn/text-base/missionxfer_cleanup.sh.svn-base'; expected: 'ab5a1f31fae2de12e7e4b8d4bf53890a', actual: 'dcab7549cbe7682006100c912c07cbc6'
            13:17:10 at org.tmatesoft.svn.core.internal.wc.SVNErrorManager.error(SVNErrorManager.java:64)
            13:17:10 at org.tmatesoft.svn.core.internal.wc.SVNErrorManager.error(SVNErrorManager.java:51)
            13:17:10 at org.tmatesoft.svn.core.internal.io.dav.http.HTTPConnection._request(HTTPConnection.java:675)
            13:17:10 at org.tmatesoft.svn.core.internal.io.dav.http.HTTPConnection.request(HTTPConnection.java:298)
            13:17:10 ... 34 more
            13:17:10 Caused by: svn: E155017: REPORT request failed on '/svn/desertowl/!svn/vcc/default'
            13:17:10 at org.tmatesoft.svn.core.SVNErrorMessage.create(SVNErrorMessage.java:208)
            13:17:10 at org.tmatesoft.svn.core.SVNErrorMessage.create(SVNErrorMessage.java:154)
            13:17:10 at org.tmatesoft.svn.core.SVNErrorMessage.create(SVNErrorMessage.java:97)
            13:17:10 at org.tmatesoft.svn.core.SVNErrorMessage.wrap(SVNErrorMessage.java:414)
            13:17:10 ... 36 more
            13:17:10 Caused by: svn: E155017: Checksum mismatch while updating '/jenkins/workspaces/DesertOwl-trunk-continuous-C/sw/scripts/dcopy/systems/lab-mp-dev/GROUND/ds/usr_local_bin/.svn/text-base/missionxfer_cleanup.sh.svn-base'; expected: 'ab5a1f31fae2de12e7e4b8d4bf53890a', actual: 'dcab7549cbe7682006100c912c07cbc6'
            13:17:10 at org.tmatesoft.svn.core.SVNErrorMessage.create(SVNErrorMessage.java:208)
            13:17:10 at org.tmatesoft.svn.core.SVNErrorMessage.create(SVNErrorMessage.java:189)
            13:17:10 at org.tmatesoft.svn.core.SVNErrorMessage.create(SVNErrorMessage.java:141)
            13:17:10 at org.tmatesoft.svn.core.internal.wc.SVNUpdateEditor15.textDeltaEnd(SVNUpdateEditor15.java:634)
            13:17:10 at org.tmatesoft.svn.core.internal.wc.SVNAmbientDepthFilterEditor.textDeltaEnd(SVNAmbientDepthFilterEditor.java:221)
            13:17:10 at org.tmatesoft.svn.core.internal.wc.SVNCancellableEditor.textDeltaEnd(SVNCancellableEditor.java:130)
            13:17:10 at org.tmatesoft.svn.core.internal.io.dav.handlers.BasicDAVDeltaHandler.setDeltaProcessing(BasicDAVDeltaHandler.java:41)
            13:17:10 at org.tmatesoft.svn.core.internal.io.dav.handlers.DAVEditorHandler.endElement(DAVEditorHandler.java:548)
            13:17:10 at org.tmatesoft.svn.core.internal.io.dav.handlers.BasicDAVHandler.endElement(BasicDAVHandler.java:103)
            13:17:10 at com.sun.org.apache.xerces.internal.parsers.AbstractSAXParser.endElement(AbstractSAXParser.java:601)
            13:17:10 at com.sun.org.apache.xerces.internal.impl.XMLDocumentFragmentScannerImpl.scanEndElement(XMLDocumentFragmentScannerImpl.java:1782)
            13:17:10 at com.sun.org.apache.xerces.internal.impl.XMLDocumentFragmentScannerImpl$FragmentContentDriver.next(XMLDocumentFragmentScannerImpl.java:2938)
            13:17:10 at com.sun.org.apache.xerces.internal.impl.XMLDocumentScannerImpl.next(XMLDocumentScannerImpl.java:648)
            13:17:10 at com.sun.org.apache.xerces.internal.impl.XMLNSDocumentScannerImpl.next(XMLNSDocumentScannerImpl.java:140)
            13:17:10 at com.sun.org.apache.xerces.internal.impl.XMLDocumentFragmentScannerImpl.scanDocument(XMLDocumentFragmentScannerImpl.java:511)
            13:17:10 at com.sun.org.apache.xerces.internal.parsers.XML11Configuration.parse(XML11Configuration.java:808)
            13:17:10 at com.sun.org.apache.xerces.internal.parsers.XML11Configuration.parse(XML11Configuration.java:737)
            13:17:10 at com.sun.org.apache.xerces.internal.parsers.XMLParser.parse(XMLParser.java:119)
            13:17:10 at com.sun.org.apache.xerces.internal.parsers.AbstractSAXParser.parse(AbstractSAXParser.java:1205)
            13:17:10 at com.sun.org.apache.xerces.internal.jaxp.SAXParserImpl$JAXPSAXParser.parse(SAXParserImpl.java:522)
            13:17:10 at org.tmatesoft.svn.core.internal.io.dav.http.HTTPConnection.readData(HTTPConnection.java:796)
            13:17:10 at org.tmatesoft.svn.core.internal.io.dav.http.HTTPConnection.readData(HTTPConnection.java:761)
            13:17:10 at org.tmatesoft.svn.core.internal.io.dav.http.HTTPRequest.dispatch(HTTPRequest.java:218)
            13:17:10 at org.tmatesoft.svn.core.internal.io.dav.http.HTTPConnection._request(HTTPConnection.java:385)
            13:17:10 ... 35 more

            Show
            vwagner Valerie Wagner added a comment - Using Subversion plugin 1.42: 13:17:10 ERROR: Failed to update https://myproject/trunk 13:17:10 org.tmatesoft.svn.core.SVNException: svn: E175002: REPORT /svn/desertowl/!svn/vcc/default failed 13:17:10 at org.tmatesoft.svn.core.internal.io.dav.http.HTTPConnection.request(HTTPConnection.java:304) 13:17:10 at org.tmatesoft.svn.core.internal.io.dav.http.HTTPConnection.request(HTTPConnection.java:289) 13:17:10 at org.tmatesoft.svn.core.internal.io.dav.http.HTTPConnection.request(HTTPConnection.java:277) 13:17:10 at org.tmatesoft.svn.core.internal.io.dav.DAVConnection.performHttpRequest(DAVConnection.java:696) 13:17:10 at org.tmatesoft.svn.core.internal.io.dav.DAVConnection.doReport(DAVConnection.java:328) 13:17:10 at org.tmatesoft.svn.core.internal.io.dav.DAVRepository.runReport(DAVRepository.java:1289) 13:17:10 at org.tmatesoft.svn.core.internal.io.dav.DAVRepository.update(DAVRepository.java:837) 13:17:10 at org.tmatesoft.svn.core.internal.wc16.SVNUpdateClient16.update(SVNUpdateClient16.java:557) 13:17:10 at org.tmatesoft.svn.core.internal.wc16.SVNUpdateClient16.doUpdate(SVNUpdateClient16.java:414) 13:17:10 at org.tmatesoft.svn.core.internal.wc16.SVNUpdateClient16.doUpdate(SVNUpdateClient16.java:324) 13:17:10 at org.tmatesoft.svn.core.internal.wc2.old.SvnOldUpdate.run(SvnOldUpdate.java:27) 13:17:10 at org.tmatesoft.svn.core.internal.wc2.old.SvnOldUpdate.run(SvnOldUpdate.java:11) 13:17:10 at org.tmatesoft.svn.core.internal.wc2.SvnOperationRunner.run(SvnOperationRunner.java:20) 13:17:10 at org.tmatesoft.svn.core.wc2.SvnOperationFactory.run(SvnOperationFactory.java:1221) 13:17:10 at org.tmatesoft.svn.core.wc2.SvnOperation.run(SvnOperation.java:292) 13:17:10 at org.tmatesoft.svn.core.wc.SVNUpdateClient.doUpdate(SVNUpdateClient.java:315) 13:17:10 at org.tmatesoft.svn.core.wc.SVNUpdateClient.doUpdate(SVNUpdateClient.java:295) 13:17:10 at org.tmatesoft.svn.core.wc.SVNUpdateClient.doUpdate(SVNUpdateClient.java:391) 13:17:10 at hudson.scm.subversion.UpdateUpdater$TaskImpl.perform(UpdateUpdater.java:136) 13:17:10 at hudson.scm.subversion.WorkspaceUpdater$UpdateTask.delegateTo(WorkspaceUpdater.java:144) 13:17:10 at hudson.scm.SubversionSCM$CheckOutTask.perform(SubversionSCM.java:789) 13:17:10 at hudson.scm.SubversionSCM$CheckOutTask.invoke(SubversionSCM.java:770) 13:17:10 at hudson.scm.SubversionSCM$CheckOutTask.invoke(SubversionSCM.java:753) 13:17:10 at hudson.FilePath.act(FilePath.java:842) 13:17:10 at hudson.FilePath.act(FilePath.java:824) 13:17:10 at hudson.scm.SubversionSCM.checkout(SubversionSCM.java:743) 13:17:10 at hudson.scm.SubversionSCM.checkout(SubversionSCM.java:685) 13:17:10 at hudson.model.AbstractProject.checkout(AbstractProject.java:1248) 13:17:10 at hudson.model.AbstractBuild$AbstractBuildExecution.defaultCheckout(AbstractBuild.java:589) 13:17:10 at jenkins.scm.SCMCheckoutStrategy.checkout(SCMCheckoutStrategy.java:88) 13:17:10 at hudson.model.AbstractBuild$AbstractBuildExecution.run(AbstractBuild.java:494) 13:17:10 at hudson.model.Run.execute(Run.java:1484) 13:17:10 at hudson.model.FreeStyleBuild.run(FreeStyleBuild.java:46) 13:17:10 at hudson.model.ResourceController.execute(ResourceController.java:88) 13:17:10 at hudson.model.Executor.run(Executor.java:236) 13:17:10 Caused by: svn: E175002: REPORT /svn/desertowl/!svn/vcc/default failed 13:17:10 at org.tmatesoft.svn.core.SVNErrorMessage.create(SVNErrorMessage.java:208) 13:17:10 at org.tmatesoft.svn.core.SVNErrorMessage.create(SVNErrorMessage.java:154) 13:17:10 at org.tmatesoft.svn.core.SVNErrorMessage.create(SVNErrorMessage.java:97) 13:17:10 ... 35 more 13:17:10 Caused by: org.tmatesoft.svn.core.SVNException: svn: E155017: REPORT request failed on '/svn/desertowl/!svn/vcc/default' 13:17:10 svn: E155017: Checksum mismatch while updating '/jenkins/workspaces/DesertOwl-trunk-continuous-C/sw/scripts/dcopy/systems/lab-mp-dev/GROUND/ds/usr_local_bin/.svn/text-base/missionxfer_cleanup.sh.svn-base'; expected: 'ab5a1f31fae2de12e7e4b8d4bf53890a', actual: 'dcab7549cbe7682006100c912c07cbc6' 13:17:10 at org.tmatesoft.svn.core.internal.wc.SVNErrorManager.error(SVNErrorManager.java:64) 13:17:10 at org.tmatesoft.svn.core.internal.wc.SVNErrorManager.error(SVNErrorManager.java:51) 13:17:10 at org.tmatesoft.svn.core.internal.io.dav.http.HTTPConnection._request(HTTPConnection.java:675) 13:17:10 at org.tmatesoft.svn.core.internal.io.dav.http.HTTPConnection.request(HTTPConnection.java:298) 13:17:10 ... 34 more 13:17:10 Caused by: svn: E155017: REPORT request failed on '/svn/desertowl/!svn/vcc/default' 13:17:10 at org.tmatesoft.svn.core.SVNErrorMessage.create(SVNErrorMessage.java:208) 13:17:10 at org.tmatesoft.svn.core.SVNErrorMessage.create(SVNErrorMessage.java:154) 13:17:10 at org.tmatesoft.svn.core.SVNErrorMessage.create(SVNErrorMessage.java:97) 13:17:10 at org.tmatesoft.svn.core.SVNErrorMessage.wrap(SVNErrorMessage.java:414) 13:17:10 ... 36 more 13:17:10 Caused by: svn: E155017: Checksum mismatch while updating '/jenkins/workspaces/DesertOwl-trunk-continuous-C/sw/scripts/dcopy/systems/lab-mp-dev/GROUND/ds/usr_local_bin/.svn/text-base/missionxfer_cleanup.sh.svn-base'; expected: 'ab5a1f31fae2de12e7e4b8d4bf53890a', actual: 'dcab7549cbe7682006100c912c07cbc6' 13:17:10 at org.tmatesoft.svn.core.SVNErrorMessage.create(SVNErrorMessage.java:208) 13:17:10 at org.tmatesoft.svn.core.SVNErrorMessage.create(SVNErrorMessage.java:189) 13:17:10 at org.tmatesoft.svn.core.SVNErrorMessage.create(SVNErrorMessage.java:141) 13:17:10 at org.tmatesoft.svn.core.internal.wc.SVNUpdateEditor15.textDeltaEnd(SVNUpdateEditor15.java:634) 13:17:10 at org.tmatesoft.svn.core.internal.wc.SVNAmbientDepthFilterEditor.textDeltaEnd(SVNAmbientDepthFilterEditor.java:221) 13:17:10 at org.tmatesoft.svn.core.internal.wc.SVNCancellableEditor.textDeltaEnd(SVNCancellableEditor.java:130) 13:17:10 at org.tmatesoft.svn.core.internal.io.dav.handlers.BasicDAVDeltaHandler.setDeltaProcessing(BasicDAVDeltaHandler.java:41) 13:17:10 at org.tmatesoft.svn.core.internal.io.dav.handlers.DAVEditorHandler.endElement(DAVEditorHandler.java:548) 13:17:10 at org.tmatesoft.svn.core.internal.io.dav.handlers.BasicDAVHandler.endElement(BasicDAVHandler.java:103) 13:17:10 at com.sun.org.apache.xerces.internal.parsers.AbstractSAXParser.endElement(AbstractSAXParser.java:601) 13:17:10 at com.sun.org.apache.xerces.internal.impl.XMLDocumentFragmentScannerImpl.scanEndElement(XMLDocumentFragmentScannerImpl.java:1782) 13:17:10 at com.sun.org.apache.xerces.internal.impl.XMLDocumentFragmentScannerImpl$FragmentContentDriver.next(XMLDocumentFragmentScannerImpl.java:2938) 13:17:10 at com.sun.org.apache.xerces.internal.impl.XMLDocumentScannerImpl.next(XMLDocumentScannerImpl.java:648) 13:17:10 at com.sun.org.apache.xerces.internal.impl.XMLNSDocumentScannerImpl.next(XMLNSDocumentScannerImpl.java:140) 13:17:10 at com.sun.org.apache.xerces.internal.impl.XMLDocumentFragmentScannerImpl.scanDocument(XMLDocumentFragmentScannerImpl.java:511) 13:17:10 at com.sun.org.apache.xerces.internal.parsers.XML11Configuration.parse(XML11Configuration.java:808) 13:17:10 at com.sun.org.apache.xerces.internal.parsers.XML11Configuration.parse(XML11Configuration.java:737) 13:17:10 at com.sun.org.apache.xerces.internal.parsers.XMLParser.parse(XMLParser.java:119) 13:17:10 at com.sun.org.apache.xerces.internal.parsers.AbstractSAXParser.parse(AbstractSAXParser.java:1205) 13:17:10 at com.sun.org.apache.xerces.internal.jaxp.SAXParserImpl$JAXPSAXParser.parse(SAXParserImpl.java:522) 13:17:10 at org.tmatesoft.svn.core.internal.io.dav.http.HTTPConnection.readData(HTTPConnection.java:796) 13:17:10 at org.tmatesoft.svn.core.internal.io.dav.http.HTTPConnection.readData(HTTPConnection.java:761) 13:17:10 at org.tmatesoft.svn.core.internal.io.dav.http.HTTPRequest.dispatch(HTTPRequest.java:218) 13:17:10 at org.tmatesoft.svn.core.internal.io.dav.http.HTTPConnection._request(HTTPConnection.java:385) 13:17:10 ... 35 more
            vwagner Valerie Wagner made changes -
            Priority Major [ 3 ] Blocker [ 1 ]
            Hide
            vwagner Valerie Wagner added a comment -

            Using Subversion plugin 1.42. This is another example, as we don't always get the same root cause.

            The reason this bug is a critical/blocker is because Jenkins does not detect that the update failed, and continues to build the project. If it happens that the project is building successfully, we may not even notice that there is a problem until someone happens to look at the raw output and see this exception. If the build fails, then it triggers in 5 minutes again, tries to build, fails to update, fails to build, spams the team. And repeats again in 5 minutes (as we check for commits every 5 minutes). This results in, for example, dozens of spam emails overnight. The only way we have to fix it is to manually delete the workspace and do a fresh checkout.

            14:45:34 org.tmatesoft.svn.core.SVNException: svn: E175002: REPORT /svn/desertowl/!svn/vcc/default failed
            14:45:34 at org.tmatesoft.svn.core.internal.io.dav.http.HTTPConnection.request(HTTPConnection.java:304)
            14:45:34 at org.tmatesoft.svn.core.internal.io.dav.http.HTTPConnection.request(HTTPConnection.java:289)
            14:45:34 at org.tmatesoft.svn.core.internal.io.dav.http.HTTPConnection.request(HTTPConnection.java:277)
            14:45:34 at org.tmatesoft.svn.core.internal.io.dav.DAVConnection.performHttpRequest(DAVConnection.java:696)
            14:45:34 at org.tmatesoft.svn.core.internal.io.dav.DAVConnection.doReport(DAVConnection.java:328)
            14:45:34 at org.tmatesoft.svn.core.internal.io.dav.DAVRepository.runReport(DAVRepository.java:1289)
            14:45:34 at org.tmatesoft.svn.core.internal.io.dav.DAVRepository.update(DAVRepository.java:837)
            14:45:34 at org.tmatesoft.svn.core.internal.wc16.SVNUpdateClient16.update(SVNUpdateClient16.java:557)
            14:45:34 at org.tmatesoft.svn.core.internal.wc16.SVNUpdateClient16.doUpdate(SVNUpdateClient16.java:414)
            14:45:34 at org.tmatesoft.svn.core.internal.wc16.SVNUpdateClient16.doUpdate(SVNUpdateClient16.java:324)
            14:45:34 at org.tmatesoft.svn.core.internal.wc2.old.SvnOldUpdate.run(SvnOldUpdate.java:27)
            14:45:34 at org.tmatesoft.svn.core.internal.wc2.old.SvnOldUpdate.run(SvnOldUpdate.java:11)
            14:45:34 at org.tmatesoft.svn.core.internal.wc2.SvnOperationRunner.run(SvnOperationRunner.java:20)
            14:45:34 at org.tmatesoft.svn.core.wc2.SvnOperationFactory.run(SvnOperationFactory.java:1221)
            14:45:34 at org.tmatesoft.svn.core.wc2.SvnOperation.run(SvnOperation.java:292)
            14:45:34 at org.tmatesoft.svn.core.wc.SVNUpdateClient.doUpdate(SVNUpdateClient.java:315)
            14:45:34 at org.tmatesoft.svn.core.wc.SVNUpdateClient.doUpdate(SVNUpdateClient.java:295)
            14:45:34 at org.tmatesoft.svn.core.wc.SVNUpdateClient.doUpdate(SVNUpdateClient.java:391)
            14:45:34 at hudson.scm.subversion.UpdateUpdater$TaskImpl.perform(UpdateUpdater.java:136)
            14:45:34 at hudson.scm.subversion.WorkspaceUpdater$UpdateTask.delegateTo(WorkspaceUpdater.java:144)
            14:45:34 at hudson.scm.SubversionSCM$CheckOutTask.perform(SubversionSCM.java:789)
            14:45:34 at hudson.scm.SubversionSCM$CheckOutTask.invoke(SubversionSCM.java:770)
            14:45:34 at hudson.scm.SubversionSCM$CheckOutTask.invoke(SubversionSCM.java:753)
            14:45:34 at hudson.FilePath.act(FilePath.java:842)
            14:45:34 at hudson.FilePath.act(FilePath.java:824)
            14:45:34 at hudson.scm.SubversionSCM.checkout(SubversionSCM.java:743)
            14:45:34 at hudson.scm.SubversionSCM.checkout(SubversionSCM.java:685)
            14:45:34 at hudson.model.AbstractProject.checkout(AbstractProject.java:1248)
            14:45:34 at hudson.model.AbstractBuild$AbstractBuildExecution.defaultCheckout(AbstractBuild.java:589)
            14:45:34 at jenkins.scm.SCMCheckoutStrategy.checkout(SCMCheckoutStrategy.java:88)
            14:45:34 at hudson.model.AbstractBuild$AbstractBuildExecution.run(AbstractBuild.java:494)
            14:45:34 at hudson.model.Run.execute(Run.java:1484)
            14:45:34 at hudson.model.FreeStyleBuild.run(FreeStyleBuild.java:46)
            14:45:34 at hudson.model.ResourceController.execute(ResourceController.java:88)
            14:45:34 at hudson.model.Executor.run(Executor.java:236)
            14:45:34 Caused by: svn: E175002: REPORT /svn/desertowl/!svn/vcc/default failed
            14:45:34 at org.tmatesoft.svn.core.SVNErrorMessage.create(SVNErrorMessage.java:208)
            14:45:34 at org.tmatesoft.svn.core.SVNErrorMessage.create(SVNErrorMessage.java:154)
            14:45:34 at org.tmatesoft.svn.core.SVNErrorMessage.create(SVNErrorMessage.java:97)
            14:45:34 ... 35 more
            14:45:34 Caused by: org.tmatesoft.svn.core.SVNException: svn: E204899: REPORT request failed on '/svn/desertowl/!svn/vcc/default'
            14:45:34 svn: E204899: Cannot write to '/jenkins/workspaces/DesertOwl-trunk-continuous-C/.svn/tmp/entries': /jenkins/workspaces/DesertOwl-trunk-continuous-C/.svn/tmp/entries (Permission denied)
            14:45:34 at org.tmatesoft.svn.core.internal.wc.SVNErrorManager.error(SVNErrorManager.java:64)
            14:45:34 at org.tmatesoft.svn.core.internal.wc.SVNErrorManager.error(SVNErrorManager.java:51)
            14:45:34 at org.tmatesoft.svn.core.internal.io.dav.http.HTTPConnection._request(HTTPConnection.java:675)
            14:45:34 at org.tmatesoft.svn.core.internal.io.dav.http.HTTPConnection.request(HTTPConnection.java:298)
            14:45:34 ... 34 more
            14:45:34 Caused by: svn: E204899: REPORT request failed on '/svn/desertowl/!svn/vcc/default'
            14:45:34 at org.tmatesoft.svn.core.SVNErrorMessage.create(SVNErrorMessage.java:208)
            14:45:34 at org.tmatesoft.svn.core.SVNErrorMessage.create(SVNErrorMessage.java:154)
            14:45:34 at org.tmatesoft.svn.core.SVNErrorMessage.create(SVNErrorMessage.java:97)
            14:45:34 at org.tmatesoft.svn.core.SVNErrorMessage.wrap(SVNErrorMessage.java:414)
            14:45:34 ... 36 more
            14:45:34 Caused by: svn: E204899: Cannot write to '/jenkins/workspaces/DesertOwl-trunk-continuous-C/.svn/tmp/entries': /jenkins/workspaces/DesertOwl-trunk-continuous-C/.svn/tmp/entries (Permission denied)
            14:45:34 at org.tmatesoft.svn.core.SVNErrorMessage.create(SVNErrorMessage.java:208)
            14:45:34 at org.tmatesoft.svn.core.SVNErrorMessage.create(SVNErrorMessage.java:189)
            14:45:34 at org.tmatesoft.svn.core.SVNErrorMessage.create(SVNErrorMessage.java:141)
            14:45:34 at org.tmatesoft.svn.core.internal.wc.SVNFileUtil.openFileForWriting(SVNFileUtil.java:1564)
            14:45:34 at org.tmatesoft.svn.core.internal.wc.SVNFileUtil.openFileForWriting(SVNFileUtil.java:1545)
            14:45:34 at org.tmatesoft.svn.core.internal.wc.admin.SVNAdminArea14.saveEntries(SVNAdminArea14.java:655)
            14:45:34 at org.tmatesoft.svn.core.internal.wc.admin.SVNAdminArea.modifyEntry(SVNAdminArea.java:910)
            14:45:34 at org.tmatesoft.svn.core.internal.wc.SVNUpdateEditor.openRoot(SVNUpdateEditor.java:189)
            14:45:34 at org.tmatesoft.svn.core.internal.wc.SVNAmbientDepthFilterEditor.openRoot(SVNAmbientDepthFilterEditor.java:196)
            14:45:34 at org.tmatesoft.svn.core.internal.wc.SVNCancellableEditor.openRoot(SVNCancellableEditor.java:60)
            14:45:34 at org.tmatesoft.svn.core.internal.io.dav.handlers.DAVEditorHandler.startElement(DAVEditorHandler.java:288)
            14:45:34 at org.tmatesoft.svn.core.internal.io.dav.handlers.BasicDAVHandler.startElement(BasicDAVHandler.java:89)
            14:45:34 at com.sun.org.apache.xerces.internal.parsers.AbstractSAXParser.startElement(AbstractSAXParser.java:501)
            14:45:34 at com.sun.org.apache.xerces.internal.impl.XMLNSDocumentScannerImpl.scanStartElement(XMLNSDocumentScannerImpl.java:400)
            14:45:34 at com.sun.org.apache.xerces.internal.impl.XMLDocumentFragmentScannerImpl$FragmentContentDriver.next(XMLDocumentFragmentScannerImpl.java:2755)
            14:45:34 at com.sun.org.apache.xerces.internal.impl.XMLDocumentScannerImpl.next(XMLDocumentScannerImpl.java:648)
            14:45:34 at com.sun.org.apache.xerces.internal.impl.XMLNSDocumentScannerImpl.next(XMLNSDocumentScannerImpl.java:140)
            14:45:34 at com.sun.org.apache.xerces.internal.impl.XMLDocumentFragmentScannerImpl.scanDocument(XMLDocumentFragmentScannerImpl.java:511)
            14:45:34 at com.sun.org.apache.xerces.internal.parsers.XML11Configuration.parse(XML11Configuration.java:808)
            14:45:34 at com.sun.org.apache.xerces.internal.parsers.XML11Configuration.parse(XML11Configuration.java:737)
            14:45:34 at com.sun.org.apache.xerces.internal.parsers.XMLParser.parse(XMLParser.java:119)
            14:45:34 at com.sun.org.apache.xerces.internal.parsers.AbstractSAXParser.parse(AbstractSAXParser.java:1205)
            14:45:34 at com.sun.org.apache.xerces.internal.jaxp.SAXParserImpl$JAXPSAXParser.parse(SAXParserImpl.java:522)
            14:45:34 at org.tmatesoft.svn.core.internal.io.dav.http.HTTPConnection.readData(HTTPConnection.java:796)
            14:45:34 at org.tmatesoft.svn.core.internal.io.dav.http.HTTPConnection.readData(HTTPConnection.java:761)
            14:45:34 at org.tmatesoft.svn.core.internal.io.dav.http.HTTPRequest.dispatch(HTTPRequest.java:218)
            14:45:34 at org.tmatesoft.svn.core.internal.io.dav.http.HTTPConnection._request(HTTPConnection.java:385)

            Show
            vwagner Valerie Wagner added a comment - Using Subversion plugin 1.42. This is another example, as we don't always get the same root cause. The reason this bug is a critical/blocker is because Jenkins does not detect that the update failed, and continues to build the project. If it happens that the project is building successfully, we may not even notice that there is a problem until someone happens to look at the raw output and see this exception. If the build fails, then it triggers in 5 minutes again, tries to build, fails to update, fails to build, spams the team. And repeats again in 5 minutes (as we check for commits every 5 minutes). This results in, for example, dozens of spam emails overnight. The only way we have to fix it is to manually delete the workspace and do a fresh checkout. 14:45:34 org.tmatesoft.svn.core.SVNException: svn: E175002: REPORT /svn/desertowl/!svn/vcc/default failed 14:45:34 at org.tmatesoft.svn.core.internal.io.dav.http.HTTPConnection.request(HTTPConnection.java:304) 14:45:34 at org.tmatesoft.svn.core.internal.io.dav.http.HTTPConnection.request(HTTPConnection.java:289) 14:45:34 at org.tmatesoft.svn.core.internal.io.dav.http.HTTPConnection.request(HTTPConnection.java:277) 14:45:34 at org.tmatesoft.svn.core.internal.io.dav.DAVConnection.performHttpRequest(DAVConnection.java:696) 14:45:34 at org.tmatesoft.svn.core.internal.io.dav.DAVConnection.doReport(DAVConnection.java:328) 14:45:34 at org.tmatesoft.svn.core.internal.io.dav.DAVRepository.runReport(DAVRepository.java:1289) 14:45:34 at org.tmatesoft.svn.core.internal.io.dav.DAVRepository.update(DAVRepository.java:837) 14:45:34 at org.tmatesoft.svn.core.internal.wc16.SVNUpdateClient16.update(SVNUpdateClient16.java:557) 14:45:34 at org.tmatesoft.svn.core.internal.wc16.SVNUpdateClient16.doUpdate(SVNUpdateClient16.java:414) 14:45:34 at org.tmatesoft.svn.core.internal.wc16.SVNUpdateClient16.doUpdate(SVNUpdateClient16.java:324) 14:45:34 at org.tmatesoft.svn.core.internal.wc2.old.SvnOldUpdate.run(SvnOldUpdate.java:27) 14:45:34 at org.tmatesoft.svn.core.internal.wc2.old.SvnOldUpdate.run(SvnOldUpdate.java:11) 14:45:34 at org.tmatesoft.svn.core.internal.wc2.SvnOperationRunner.run(SvnOperationRunner.java:20) 14:45:34 at org.tmatesoft.svn.core.wc2.SvnOperationFactory.run(SvnOperationFactory.java:1221) 14:45:34 at org.tmatesoft.svn.core.wc2.SvnOperation.run(SvnOperation.java:292) 14:45:34 at org.tmatesoft.svn.core.wc.SVNUpdateClient.doUpdate(SVNUpdateClient.java:315) 14:45:34 at org.tmatesoft.svn.core.wc.SVNUpdateClient.doUpdate(SVNUpdateClient.java:295) 14:45:34 at org.tmatesoft.svn.core.wc.SVNUpdateClient.doUpdate(SVNUpdateClient.java:391) 14:45:34 at hudson.scm.subversion.UpdateUpdater$TaskImpl.perform(UpdateUpdater.java:136) 14:45:34 at hudson.scm.subversion.WorkspaceUpdater$UpdateTask.delegateTo(WorkspaceUpdater.java:144) 14:45:34 at hudson.scm.SubversionSCM$CheckOutTask.perform(SubversionSCM.java:789) 14:45:34 at hudson.scm.SubversionSCM$CheckOutTask.invoke(SubversionSCM.java:770) 14:45:34 at hudson.scm.SubversionSCM$CheckOutTask.invoke(SubversionSCM.java:753) 14:45:34 at hudson.FilePath.act(FilePath.java:842) 14:45:34 at hudson.FilePath.act(FilePath.java:824) 14:45:34 at hudson.scm.SubversionSCM.checkout(SubversionSCM.java:743) 14:45:34 at hudson.scm.SubversionSCM.checkout(SubversionSCM.java:685) 14:45:34 at hudson.model.AbstractProject.checkout(AbstractProject.java:1248) 14:45:34 at hudson.model.AbstractBuild$AbstractBuildExecution.defaultCheckout(AbstractBuild.java:589) 14:45:34 at jenkins.scm.SCMCheckoutStrategy.checkout(SCMCheckoutStrategy.java:88) 14:45:34 at hudson.model.AbstractBuild$AbstractBuildExecution.run(AbstractBuild.java:494) 14:45:34 at hudson.model.Run.execute(Run.java:1484) 14:45:34 at hudson.model.FreeStyleBuild.run(FreeStyleBuild.java:46) 14:45:34 at hudson.model.ResourceController.execute(ResourceController.java:88) 14:45:34 at hudson.model.Executor.run(Executor.java:236) 14:45:34 Caused by: svn: E175002: REPORT /svn/desertowl/!svn/vcc/default failed 14:45:34 at org.tmatesoft.svn.core.SVNErrorMessage.create(SVNErrorMessage.java:208) 14:45:34 at org.tmatesoft.svn.core.SVNErrorMessage.create(SVNErrorMessage.java:154) 14:45:34 at org.tmatesoft.svn.core.SVNErrorMessage.create(SVNErrorMessage.java:97) 14:45:34 ... 35 more 14:45:34 Caused by: org.tmatesoft.svn.core.SVNException: svn: E204899: REPORT request failed on '/svn/desertowl/!svn/vcc/default' 14:45:34 svn: E204899: Cannot write to '/jenkins/workspaces/DesertOwl-trunk-continuous-C/.svn/tmp/entries': /jenkins/workspaces/DesertOwl-trunk-continuous-C/.svn/tmp/entries (Permission denied) 14:45:34 at org.tmatesoft.svn.core.internal.wc.SVNErrorManager.error(SVNErrorManager.java:64) 14:45:34 at org.tmatesoft.svn.core.internal.wc.SVNErrorManager.error(SVNErrorManager.java:51) 14:45:34 at org.tmatesoft.svn.core.internal.io.dav.http.HTTPConnection._request(HTTPConnection.java:675) 14:45:34 at org.tmatesoft.svn.core.internal.io.dav.http.HTTPConnection.request(HTTPConnection.java:298) 14:45:34 ... 34 more 14:45:34 Caused by: svn: E204899: REPORT request failed on '/svn/desertowl/!svn/vcc/default' 14:45:34 at org.tmatesoft.svn.core.SVNErrorMessage.create(SVNErrorMessage.java:208) 14:45:34 at org.tmatesoft.svn.core.SVNErrorMessage.create(SVNErrorMessage.java:154) 14:45:34 at org.tmatesoft.svn.core.SVNErrorMessage.create(SVNErrorMessage.java:97) 14:45:34 at org.tmatesoft.svn.core.SVNErrorMessage.wrap(SVNErrorMessage.java:414) 14:45:34 ... 36 more 14:45:34 Caused by: svn: E204899: Cannot write to '/jenkins/workspaces/DesertOwl-trunk-continuous-C/.svn/tmp/entries': /jenkins/workspaces/DesertOwl-trunk-continuous-C/.svn/tmp/entries (Permission denied) 14:45:34 at org.tmatesoft.svn.core.SVNErrorMessage.create(SVNErrorMessage.java:208) 14:45:34 at org.tmatesoft.svn.core.SVNErrorMessage.create(SVNErrorMessage.java:189) 14:45:34 at org.tmatesoft.svn.core.SVNErrorMessage.create(SVNErrorMessage.java:141) 14:45:34 at org.tmatesoft.svn.core.internal.wc.SVNFileUtil.openFileForWriting(SVNFileUtil.java:1564) 14:45:34 at org.tmatesoft.svn.core.internal.wc.SVNFileUtil.openFileForWriting(SVNFileUtil.java:1545) 14:45:34 at org.tmatesoft.svn.core.internal.wc.admin.SVNAdminArea14.saveEntries(SVNAdminArea14.java:655) 14:45:34 at org.tmatesoft.svn.core.internal.wc.admin.SVNAdminArea.modifyEntry(SVNAdminArea.java:910) 14:45:34 at org.tmatesoft.svn.core.internal.wc.SVNUpdateEditor.openRoot(SVNUpdateEditor.java:189) 14:45:34 at org.tmatesoft.svn.core.internal.wc.SVNAmbientDepthFilterEditor.openRoot(SVNAmbientDepthFilterEditor.java:196) 14:45:34 at org.tmatesoft.svn.core.internal.wc.SVNCancellableEditor.openRoot(SVNCancellableEditor.java:60) 14:45:34 at org.tmatesoft.svn.core.internal.io.dav.handlers.DAVEditorHandler.startElement(DAVEditorHandler.java:288) 14:45:34 at org.tmatesoft.svn.core.internal.io.dav.handlers.BasicDAVHandler.startElement(BasicDAVHandler.java:89) 14:45:34 at com.sun.org.apache.xerces.internal.parsers.AbstractSAXParser.startElement(AbstractSAXParser.java:501) 14:45:34 at com.sun.org.apache.xerces.internal.impl.XMLNSDocumentScannerImpl.scanStartElement(XMLNSDocumentScannerImpl.java:400) 14:45:34 at com.sun.org.apache.xerces.internal.impl.XMLDocumentFragmentScannerImpl$FragmentContentDriver.next(XMLDocumentFragmentScannerImpl.java:2755) 14:45:34 at com.sun.org.apache.xerces.internal.impl.XMLDocumentScannerImpl.next(XMLDocumentScannerImpl.java:648) 14:45:34 at com.sun.org.apache.xerces.internal.impl.XMLNSDocumentScannerImpl.next(XMLNSDocumentScannerImpl.java:140) 14:45:34 at com.sun.org.apache.xerces.internal.impl.XMLDocumentFragmentScannerImpl.scanDocument(XMLDocumentFragmentScannerImpl.java:511) 14:45:34 at com.sun.org.apache.xerces.internal.parsers.XML11Configuration.parse(XML11Configuration.java:808) 14:45:34 at com.sun.org.apache.xerces.internal.parsers.XML11Configuration.parse(XML11Configuration.java:737) 14:45:34 at com.sun.org.apache.xerces.internal.parsers.XMLParser.parse(XMLParser.java:119) 14:45:34 at com.sun.org.apache.xerces.internal.parsers.AbstractSAXParser.parse(AbstractSAXParser.java:1205) 14:45:34 at com.sun.org.apache.xerces.internal.jaxp.SAXParserImpl$JAXPSAXParser.parse(SAXParserImpl.java:522) 14:45:34 at org.tmatesoft.svn.core.internal.io.dav.http.HTTPConnection.readData(HTTPConnection.java:796) 14:45:34 at org.tmatesoft.svn.core.internal.io.dav.http.HTTPConnection.readData(HTTPConnection.java:761) 14:45:34 at org.tmatesoft.svn.core.internal.io.dav.http.HTTPRequest.dispatch(HTTPRequest.java:218) 14:45:34 at org.tmatesoft.svn.core.internal.io.dav.http.HTTPConnection._request(HTTPConnection.java:385)
            Hide
            arvid_ Arvid Arntzen added a comment -

            This error have started to appear randomly and quite often, mostly on matrix build jobs both on the parent job and children. It is a big problem for us since it fails nightly builds that takes several hours to rebuild, and often the rebuild results in the same error. The error started to occur after updating to Subversion plugin from 1.39 to 1.42.

            Currently using Jenkins 1.477 with Subversion plugin 1.42.

            org.tmatesoft.svn.core.SVNException: svn: E175002: REPORT /svn/vivid/!svn/vcc/default failed
            at org.tmatesoft.svn.core.internal.io.dav.http.HTTPConnection.request(HTTPConnection.java:304)
            at org.tmatesoft.svn.core.internal.io.dav.http.HTTPConnection.request(HTTPConnection.java:289)
            at org.tmatesoft.svn.core.internal.io.dav.http.HTTPConnection.request(HTTPConnection.java:277)
            at org.tmatesoft.svn.core.internal.io.dav.DAVConnection.performHttpRequest(DAVConnection.java:696)
            at org.tmatesoft.svn.core.internal.io.dav.DAVConnection.doReport(DAVConnection.java:328)
            at org.tmatesoft.svn.core.internal.io.dav.DAVRepository.runReport(DAVRepository.java:1289)
            at org.tmatesoft.svn.core.internal.io.dav.DAVRepository.update(DAVRepository.java:837)
            at org.tmatesoft.svn.core.internal.wc2.ng.SvnNgAbstractUpdate.updateInternal(SvnNgAbstractUpdate.java:216)
            at org.tmatesoft.svn.core.internal.wc2.ng.SvnNgAbstractUpdate.update(SvnNgAbstractUpdate.java:100)
            at org.tmatesoft.svn.core.internal.wc2.ng.SvnNgAbstractUpdate.checkout(SvnNgAbstractUpdate.java:756)
            at org.tmatesoft.svn.core.internal.wc2.ng.SvnNgCheckout.run(SvnNgCheckout.java:14)
            at org.tmatesoft.svn.core.internal.wc2.ng.SvnNgCheckout.run(SvnNgCheckout.java:9)
            at org.tmatesoft.svn.core.internal.wc2.ng.SvnNgOperationRunner.run(SvnNgOperationRunner.java:20)
            at org.tmatesoft.svn.core.internal.wc2.SvnOperationRunner.run(SvnOperationRunner.java:20)
            at org.tmatesoft.svn.core.wc2.SvnOperationFactory.run(SvnOperationFactory.java:1221)
            at org.tmatesoft.svn.core.wc2.SvnOperation.run(SvnOperation.java:292)
            at org.tmatesoft.svn.core.wc.SVNUpdateClient.doCheckout(SVNUpdateClient.java:781)
            at hudson.scm.subversion.CheckoutUpdater$1.perform(CheckoutUpdater.java:85)
            at hudson.scm.subversion.WorkspaceUpdater$UpdateTask.delegateTo(WorkspaceUpdater.java:144)
            at hudson.scm.SubversionSCM$CheckOutTask.perform(SubversionSCM.java:789)
            at hudson.scm.SubversionSCM$CheckOutTask.invoke(SubversionSCM.java:770)
            at hudson.scm.SubversionSCM$CheckOutTask.invoke(SubversionSCM.java:753)
            at hudson.FilePath.act(FilePath.java:842)
            at hudson.FilePath.act(FilePath.java:824)
            at hudson.scm.SubversionSCM.checkout(SubversionSCM.java:743)
            at hudson.scm.SubversionSCM.checkout(SubversionSCM.java:685)
            at hudson.model.AbstractProject.checkout(AbstractProject.java:1256)
            at hudson.model.AbstractBuild$AbstractBuildExecution.defaultCheckout(AbstractBuild.java:589)
            at jenkins.scm.SCMCheckoutStrategy.checkout(SCMCheckoutStrategy.java:88)
            at hudson.model.AbstractBuild$AbstractBuildExecution.run(AbstractBuild.java:494)
            at hudson.model.Run.execute(Run.java:1502)
            at hudson.matrix.MatrixBuild.run(MatrixBuild.java:289)
            at hudson.model.ResourceController.execute(ResourceController.java:88)
            at hudson.model.Executor.run(Executor.java:236)
            at hudson.model.OneOffExecutor.run(OneOffExecutor.java:66)
            Caused by: svn: E175002: REPORT /svn/vivid/!svn/vcc/default failed
            at org.tmatesoft.svn.core.SVNErrorMessage.create(SVNErrorMessage.java:208)
            at org.tmatesoft.svn.core.SVNErrorMessage.create(SVNErrorMessage.java:154)
            at org.tmatesoft.svn.core.SVNErrorMessage.create(SVNErrorMessage.java:97)
            ... 35 more
            Caused by: org.tmatesoft.svn.core.SVNException: svn: E175002: REPORT request failed on '/svn/vivid/!svn/vcc/default'
            svn: E175002: chunked stream ended unexpectedly
            at org.tmatesoft.svn.core.internal.wc.SVNErrorManager.error(SVNErrorManager.java:64)
            at org.tmatesoft.svn.core.internal.wc.SVNErrorManager.error(SVNErrorManager.java:51)
            at org.tmatesoft.svn.core.internal.io.dav.http.HTTPConnection._request(HTTPConnection.java:681)
            at org.tmatesoft.svn.core.internal.io.dav.http.HTTPConnection.request(HTTPConnection.java:298)
            ... 34 more
            Caused by: svn: E175002: REPORT request failed on '/svn/vivid/!svn/vcc/default'
            at org.tmatesoft.svn.core.SVNErrorMessage.create(SVNErrorMessage.java:208)
            at org.tmatesoft.svn.core.internal.io.dav.http.HTTPConnection._request(HTTPConnection.java:679)
            ... 35 more
            Caused by: svn: E175002: chunked stream ended unexpectedly
            at org.tmatesoft.svn.core.SVNErrorMessage.create(SVNErrorMessage.java:109)
            at org.tmatesoft.svn.core.internal.io.dav.http.HTTPConnection._request(HTTPConnection.java:433)
            ... 35 more
            Caused by: java.io.IOException: chunked stream ended unexpectedly
            at org.tmatesoft.svn.core.internal.util.ChunkedInputStream.getChunkSizeFromInputStream(ChunkedInputStream.java:113)
            at org.tmatesoft.svn.core.internal.util.ChunkedInputStream.nextChunk(ChunkedInputStream.java:97)
            at org.tmatesoft.svn.core.internal.util.ChunkedInputStream.read(ChunkedInputStream.java:69)
            at sun.nio.cs.StreamDecoder.readBytes(Unknown Source)
            at sun.nio.cs.StreamDecoder.implRead(Unknown Source)
            at sun.nio.cs.StreamDecoder.read(Unknown Source)
            at java.io.InputStreamReader.read(Unknown Source)
            at org.tmatesoft.svn.core.internal.io.dav.http.XMLReader.read(XMLReader.java:39)
            at com.sun.org.apache.xerces.internal.impl.XMLEntityScanner.load(Unknown Source)
            at com.sun.org.apache.xerces.internal.impl.XMLEntityScanner.skipChar(Unknown Source)
            at com.sun.org.apache.xerces.internal.impl.XMLDocumentFragmentScannerImpl$FragmentContentDriver.next(Unknown Source)
            at com.sun.org.apache.xerces.internal.impl.XMLDocumentScannerImpl.next(Unknown Source)
            at com.sun.org.apache.xerces.internal.impl.XMLNSDocumentScannerImpl.next(Unknown Source)
            at com.sun.org.apache.xerces.internal.impl.XMLDocumentFragmentScannerImpl.scanDocument(Unknown Source)
            at com.sun.org.apache.xerces.internal.parsers.XML11Configuration.parse(Unknown Source)
            at com.sun.org.apache.xerces.internal.parsers.XML11Configuration.parse(Unknown Source)
            at com.sun.org.apache.xerces.internal.parsers.XMLParser.parse(Unknown Source)
            at com.sun.org.apache.xerces.internal.parsers.AbstractSAXParser.parse(Unknown Source)
            at com.sun.org.apache.xerces.internal.jaxp.SAXParserImpl$JAXPSAXParser.parse(Unknown Source)
            at org.tmatesoft.svn.core.internal.io.dav.http.HTTPConnection.readData(HTTPConnection.java:796)
            at org.tmatesoft.svn.core.internal.io.dav.http.HTTPConnection.readData(HTTPConnection.java:761)
            at org.tmatesoft.svn.core.internal.io.dav.http.HTTPRequest.dispatch(HTTPRequest.java:218)
            at org.tmatesoft.svn.core.internal.io.dav.http.HTTPConnection._request(HTTPConnection.java:385)
            ... 35 more

            Show
            arvid_ Arvid Arntzen added a comment - This error have started to appear randomly and quite often, mostly on matrix build jobs both on the parent job and children. It is a big problem for us since it fails nightly builds that takes several hours to rebuild, and often the rebuild results in the same error. The error started to occur after updating to Subversion plugin from 1.39 to 1.42. Currently using Jenkins 1.477 with Subversion plugin 1.42. org.tmatesoft.svn.core.SVNException: svn: E175002: REPORT /svn/vivid/!svn/vcc/default failed at org.tmatesoft.svn.core.internal.io.dav.http.HTTPConnection.request(HTTPConnection.java:304) at org.tmatesoft.svn.core.internal.io.dav.http.HTTPConnection.request(HTTPConnection.java:289) at org.tmatesoft.svn.core.internal.io.dav.http.HTTPConnection.request(HTTPConnection.java:277) at org.tmatesoft.svn.core.internal.io.dav.DAVConnection.performHttpRequest(DAVConnection.java:696) at org.tmatesoft.svn.core.internal.io.dav.DAVConnection.doReport(DAVConnection.java:328) at org.tmatesoft.svn.core.internal.io.dav.DAVRepository.runReport(DAVRepository.java:1289) at org.tmatesoft.svn.core.internal.io.dav.DAVRepository.update(DAVRepository.java:837) at org.tmatesoft.svn.core.internal.wc2.ng.SvnNgAbstractUpdate.updateInternal(SvnNgAbstractUpdate.java:216) at org.tmatesoft.svn.core.internal.wc2.ng.SvnNgAbstractUpdate.update(SvnNgAbstractUpdate.java:100) at org.tmatesoft.svn.core.internal.wc2.ng.SvnNgAbstractUpdate.checkout(SvnNgAbstractUpdate.java:756) at org.tmatesoft.svn.core.internal.wc2.ng.SvnNgCheckout.run(SvnNgCheckout.java:14) at org.tmatesoft.svn.core.internal.wc2.ng.SvnNgCheckout.run(SvnNgCheckout.java:9) at org.tmatesoft.svn.core.internal.wc2.ng.SvnNgOperationRunner.run(SvnNgOperationRunner.java:20) at org.tmatesoft.svn.core.internal.wc2.SvnOperationRunner.run(SvnOperationRunner.java:20) at org.tmatesoft.svn.core.wc2.SvnOperationFactory.run(SvnOperationFactory.java:1221) at org.tmatesoft.svn.core.wc2.SvnOperation.run(SvnOperation.java:292) at org.tmatesoft.svn.core.wc.SVNUpdateClient.doCheckout(SVNUpdateClient.java:781) at hudson.scm.subversion.CheckoutUpdater$1.perform(CheckoutUpdater.java:85) at hudson.scm.subversion.WorkspaceUpdater$UpdateTask.delegateTo(WorkspaceUpdater.java:144) at hudson.scm.SubversionSCM$CheckOutTask.perform(SubversionSCM.java:789) at hudson.scm.SubversionSCM$CheckOutTask.invoke(SubversionSCM.java:770) at hudson.scm.SubversionSCM$CheckOutTask.invoke(SubversionSCM.java:753) at hudson.FilePath.act(FilePath.java:842) at hudson.FilePath.act(FilePath.java:824) at hudson.scm.SubversionSCM.checkout(SubversionSCM.java:743) at hudson.scm.SubversionSCM.checkout(SubversionSCM.java:685) at hudson.model.AbstractProject.checkout(AbstractProject.java:1256) at hudson.model.AbstractBuild$AbstractBuildExecution.defaultCheckout(AbstractBuild.java:589) at jenkins.scm.SCMCheckoutStrategy.checkout(SCMCheckoutStrategy.java:88) at hudson.model.AbstractBuild$AbstractBuildExecution.run(AbstractBuild.java:494) at hudson.model.Run.execute(Run.java:1502) at hudson.matrix.MatrixBuild.run(MatrixBuild.java:289) at hudson.model.ResourceController.execute(ResourceController.java:88) at hudson.model.Executor.run(Executor.java:236) at hudson.model.OneOffExecutor.run(OneOffExecutor.java:66) Caused by: svn: E175002: REPORT /svn/vivid/!svn/vcc/default failed at org.tmatesoft.svn.core.SVNErrorMessage.create(SVNErrorMessage.java:208) at org.tmatesoft.svn.core.SVNErrorMessage.create(SVNErrorMessage.java:154) at org.tmatesoft.svn.core.SVNErrorMessage.create(SVNErrorMessage.java:97) ... 35 more Caused by: org.tmatesoft.svn.core.SVNException: svn: E175002: REPORT request failed on '/svn/vivid/!svn/vcc/default' svn: E175002: chunked stream ended unexpectedly at org.tmatesoft.svn.core.internal.wc.SVNErrorManager.error(SVNErrorManager.java:64) at org.tmatesoft.svn.core.internal.wc.SVNErrorManager.error(SVNErrorManager.java:51) at org.tmatesoft.svn.core.internal.io.dav.http.HTTPConnection._request(HTTPConnection.java:681) at org.tmatesoft.svn.core.internal.io.dav.http.HTTPConnection.request(HTTPConnection.java:298) ... 34 more Caused by: svn: E175002: REPORT request failed on '/svn/vivid/!svn/vcc/default' at org.tmatesoft.svn.core.SVNErrorMessage.create(SVNErrorMessage.java:208) at org.tmatesoft.svn.core.internal.io.dav.http.HTTPConnection._request(HTTPConnection.java:679) ... 35 more Caused by: svn: E175002: chunked stream ended unexpectedly at org.tmatesoft.svn.core.SVNErrorMessage.create(SVNErrorMessage.java:109) at org.tmatesoft.svn.core.internal.io.dav.http.HTTPConnection._request(HTTPConnection.java:433) ... 35 more Caused by: java.io.IOException: chunked stream ended unexpectedly at org.tmatesoft.svn.core.internal.util.ChunkedInputStream.getChunkSizeFromInputStream(ChunkedInputStream.java:113) at org.tmatesoft.svn.core.internal.util.ChunkedInputStream.nextChunk(ChunkedInputStream.java:97) at org.tmatesoft.svn.core.internal.util.ChunkedInputStream.read(ChunkedInputStream.java:69) at sun.nio.cs.StreamDecoder.readBytes(Unknown Source) at sun.nio.cs.StreamDecoder.implRead(Unknown Source) at sun.nio.cs.StreamDecoder.read(Unknown Source) at java.io.InputStreamReader.read(Unknown Source) at org.tmatesoft.svn.core.internal.io.dav.http.XMLReader.read(XMLReader.java:39) at com.sun.org.apache.xerces.internal.impl.XMLEntityScanner.load(Unknown Source) at com.sun.org.apache.xerces.internal.impl.XMLEntityScanner.skipChar(Unknown Source) at com.sun.org.apache.xerces.internal.impl.XMLDocumentFragmentScannerImpl$FragmentContentDriver.next(Unknown Source) at com.sun.org.apache.xerces.internal.impl.XMLDocumentScannerImpl.next(Unknown Source) at com.sun.org.apache.xerces.internal.impl.XMLNSDocumentScannerImpl.next(Unknown Source) at com.sun.org.apache.xerces.internal.impl.XMLDocumentFragmentScannerImpl.scanDocument(Unknown Source) at com.sun.org.apache.xerces.internal.parsers.XML11Configuration.parse(Unknown Source) at com.sun.org.apache.xerces.internal.parsers.XML11Configuration.parse(Unknown Source) at com.sun.org.apache.xerces.internal.parsers.XMLParser.parse(Unknown Source) at com.sun.org.apache.xerces.internal.parsers.AbstractSAXParser.parse(Unknown Source) at com.sun.org.apache.xerces.internal.jaxp.SAXParserImpl$JAXPSAXParser.parse(Unknown Source) at org.tmatesoft.svn.core.internal.io.dav.http.HTTPConnection.readData(HTTPConnection.java:796) at org.tmatesoft.svn.core.internal.io.dav.http.HTTPConnection.readData(HTTPConnection.java:761) at org.tmatesoft.svn.core.internal.io.dav.http.HTTPRequest.dispatch(HTTPRequest.java:218) at org.tmatesoft.svn.core.internal.io.dav.http.HTTPConnection._request(HTTPConnection.java:385) ... 35 more
            Hide
            chris_lee Chris Lee added a comment -

            Issue #2 - emulate clean checkout not working for SVN 1.7 working copies - is detailed in JENKINS-13844, which contains a code change to address this issue.

            Show
            chris_lee Chris Lee added a comment - Issue #2 - emulate clean checkout not working for SVN 1.7 working copies - is detailed in JENKINS-13844 , which contains a code change to address this issue.
            Hide
            leonidax Leon Moctezuma added a comment -

            Issue #1

            I'm having this problem on a Mac OS 10.8

            Jenkins version 1.493

            Subversion Plugin 1.43

            FAILED: svn: E175002: OPTIONS /vc/repos failed
            org.tmatesoft.svn.core.SVNException: svn: E175002: OPTIONS /vc/repos failed
            at org.tmatesoft.svn.core.internal.io.dav.http.HTTPConnection.request(HTTPConnection.java:304)
            at org.tmatesoft.svn.core.internal.io.dav.http.HTTPConnection.request(HTTPConnection.java:289)
            at org.tmatesoft.svn.core.internal.io.dav.http.HTTPConnection.request(HTTPConnection.java:277)
            at org.tmatesoft.svn.core.internal.io.dav.DAVConnection.performHttpRequest(DAVConnection.java:696)
            at org.tmatesoft.svn.core.internal.io.dav.DAVConnection.exchangeCapabilities(DAVConnection.java:619)
            at org.tmatesoft.svn.core.internal.io.dav.DAVConnection.open(DAVConnection.java:103)
            at org.tmatesoft.svn.core.internal.io.dav.DAVRepository.openConnection(DAVRepository.java:1018)
            at org.tmatesoft.svn.core.internal.io.dav.DAVRepository.testConnection(DAVRepository.java:99)
            at hudson.scm.SubversionSCM$DescriptorImpl.postCredential(SubversionSCM.java:1978)
            at hudson.scm.SubversionSCM$DescriptorImpl.doPostCredential(SubversionSCM.java:1923)
            at sun.reflect.NativeMethodAccessorImpl.invoke0(Native Method)
            at sun.reflect.NativeMethodAccessorImpl.invoke(NativeMethodAccessorImpl.java:39)
            at sun.reflect.DelegatingMethodAccessorImpl.invoke(DelegatingMethodAccessorImpl.java:25)
            at java.lang.reflect.Method.invoke(Method.java:597)
            at org.kohsuke.stapler.Function$InstanceFunction.invoke(Function.java:288)
            at org.kohsuke.stapler.Function.bindAndInvoke(Function.java:151)
            at org.kohsuke.stapler.Function.bindAndInvokeAndServeResponse(Function.java:90)
            at org.kohsuke.stapler.MetaClass$1.doDispatch(MetaClass.java:111)
            at org.kohsuke.stapler.NameBasedDispatcher.dispatch(NameBasedDispatcher.java:53)
            at org.kohsuke.stapler.Stapler.tryInvoke(Stapler.java:573)
            at org.kohsuke.stapler.Stapler.invoke(Stapler.java:658)
            at org.kohsuke.stapler.MetaClass$6.doDispatch(MetaClass.java:241)
            at org.kohsuke.stapler.NameBasedDispatcher.dispatch(NameBasedDispatcher.java:53)
            at org.kohsuke.stapler.Stapler.tryInvoke(Stapler.java:573)
            at org.kohsuke.stapler.Stapler.invoke(Stapler.java:658)
            at org.kohsuke.stapler.MetaClass$6.doDispatch(MetaClass.java:241)
            at org.kohsuke.stapler.NameBasedDispatcher.dispatch(NameBasedDispatcher.java:53)
            at org.kohsuke.stapler.Stapler.tryInvoke(Stapler.java:573)
            at org.kohsuke.stapler.Stapler.invoke(Stapler.java:658)
            at org.kohsuke.stapler.Stapler.invoke(Stapler.java:487)
            at org.kohsuke.stapler.Stapler.service(Stapler.java:164)
            at javax.servlet.http.HttpServlet.service(HttpServlet.java:45)
            at winstone.ServletConfiguration.execute(ServletConfiguration.java:248)
            at winstone.RequestDispatcher.forward(RequestDispatcher.java:333)
            at winstone.RequestDispatcher.doFilter(RequestDispatcher.java:376)
            at hudson.util.PluginServletFilter$1.doFilter(PluginServletFilter.java:95)
            at hudson.util.PluginServletFilter.doFilter(PluginServletFilter.java:87)
            at winstone.FilterConfiguration.execute(FilterConfiguration.java:194)
            at winstone.RequestDispatcher.doFilter(RequestDispatcher.java:366)
            at hudson.security.csrf.CrumbFilter.doFilter(CrumbFilter.java:47)
            at winstone.FilterConfiguration.execute(FilterConfiguration.java:194)
            at winstone.RequestDispatcher.doFilter(RequestDispatcher.java:366)
            at hudson.security.ChainedServletFilter$1.doFilter(ChainedServletFilter.java:84)
            at hudson.security.ChainedServletFilter.doFilter(ChainedServletFilter.java:76)
            at hudson.security.HudsonFilter.doFilter(HudsonFilter.java:164)
            at winstone.FilterConfiguration.execute(FilterConfiguration.java:194)
            at winstone.RequestDispatcher.doFilter(RequestDispatcher.java:366)
            at org.kohsuke.stapler.compression.CompressionFilter.doFilter(CompressionFilter.java:50)
            at winstone.FilterConfiguration.execute(FilterConfiguration.java:194)
            at winstone.RequestDispatcher.doFilter(RequestDispatcher.java:366)
            at hudson.util.CharacterEncodingFilter.doFilter(CharacterEncodingFilter.java:81)
            at winstone.FilterConfiguration.execute(FilterConfiguration.java:194)
            at winstone.RequestDispatcher.doFilter(RequestDispatcher.java:366)
            at winstone.RequestDispatcher.forward(RequestDispatcher.java:331)
            at winstone.RequestHandlerThread.processRequest(RequestHandlerThread.java:215)
            at winstone.RequestHandlerThread.run(RequestHandlerThread.java:138)
            at java.util.concurrent.Executors$RunnableAdapter.call(Executors.java:441)
            at java.util.concurrent.FutureTask$Sync.innerRun(FutureTask.java:303)
            at java.util.concurrent.FutureTask.run(FutureTask.java:138)
            at winstone.BoundedExecutorService$1.run(BoundedExecutorService.java:77)
            at java.util.concurrent.ThreadPoolExecutor$Worker.runTask(ThreadPoolExecutor.java:886)
            at java.util.concurrent.ThreadPoolExecutor$Worker.run(ThreadPoolExecutor.java:908)
            at java.lang.Thread.run(Thread.java:680)
            Caused by: svn: E175002: OPTIONS /vc/repos failed
            at org.tmatesoft.svn.core.SVNErrorMessage.create(SVNErrorMessage.java:208)
            at org.tmatesoft.svn.core.SVNErrorMessage.create(SVNErrorMessage.java:154)
            at org.tmatesoft.svn.core.SVNErrorMessage.create(SVNErrorMessage.java:97)
            ... 63 more
            Caused by: org.tmatesoft.svn.core.SVNException: svn: E175002: OPTIONS request failed on '/vc/repos'
            svn: E175002: Received fatal alert: bad_record_mac
            at org.tmatesoft.svn.core.internal.wc.SVNErrorManager.error(SVNErrorManager.java:64)
            at org.tmatesoft.svn.core.internal.wc.SVNErrorManager.error(SVNErrorManager.java:51)
            at org.tmatesoft.svn.core.internal.io.dav.http.HTTPConnection._request(HTTPConnection.java:681)
            at org.tmatesoft.svn.core.internal.io.dav.http.HTTPConnection.request(HTTPConnection.java:298)
            ... 62 more
            Caused by: svn: E175002: OPTIONS request failed on '/vc/repos'
            at org.tmatesoft.svn.core.SVNErrorMessage.create(SVNErrorMessage.java:208)
            at org.tmatesoft.svn.core.internal.io.dav.http.HTTPConnection._request(HTTPConnection.java:679)
            ... 63 more
            Caused by: svn: E175002: Received fatal alert: bad_record_mac
            at org.tmatesoft.svn.core.SVNErrorMessage.create(SVNErrorMessage.java:109)
            at org.tmatesoft.svn.core.internal.io.dav.http.HTTPConnection._request(HTTPConnection.java:430)
            ... 63 more
            Caused by: javax.net.ssl.SSLException: Received fatal alert: bad_record_mac
            at com.sun.net.ssl.internal.ssl.Alerts.getSSLException(Alerts.java:190)
            at com.sun.net.ssl.internal.ssl.Alerts.getSSLException(Alerts.java:136)
            at com.sun.net.ssl.internal.ssl.SSLSocketImpl.recvAlert(SSLSocketImpl.java:1839)
            at com.sun.net.ssl.internal.ssl.SSLSocketImpl.readRecord(SSLSocketImpl.java:1019)
            at com.sun.net.ssl.internal.ssl.SSLSocketImpl.performInitialHandshake(SSLSocketImpl.java:1203)
            at com.sun.net.ssl.internal.ssl.SSLSocketImpl.writeRecord(SSLSocketImpl.java:654)
            at com.sun.net.ssl.internal.ssl.AppOutputStream.write(AppOutputStream.java:100)
            at java.io.BufferedOutputStream.flushBuffer(BufferedOutputStream.java:65)
            at java.io.BufferedOutputStream.flush(BufferedOutputStream.java:123)
            at org.tmatesoft.svn.core.internal.io.dav.http.HTTPConnection.sendData(HTTPConnection.java:238)
            at org.tmatesoft.svn.core.internal.io.dav.http.HTTPRequest.dispatch(HTTPRequest.java:168)
            at org.tmatesoft.svn.core.internal.io.dav.http.HTTPConnection._request(HTTPConnection.java:385)
            ... 63 more

            Show
            leonidax Leon Moctezuma added a comment - Issue #1 I'm having this problem on a Mac OS 10.8 Jenkins version 1.493 Subversion Plugin 1.43 FAILED: svn: E175002: OPTIONS /vc/repos failed org.tmatesoft.svn.core.SVNException: svn: E175002: OPTIONS /vc/repos failed at org.tmatesoft.svn.core.internal.io.dav.http.HTTPConnection.request(HTTPConnection.java:304) at org.tmatesoft.svn.core.internal.io.dav.http.HTTPConnection.request(HTTPConnection.java:289) at org.tmatesoft.svn.core.internal.io.dav.http.HTTPConnection.request(HTTPConnection.java:277) at org.tmatesoft.svn.core.internal.io.dav.DAVConnection.performHttpRequest(DAVConnection.java:696) at org.tmatesoft.svn.core.internal.io.dav.DAVConnection.exchangeCapabilities(DAVConnection.java:619) at org.tmatesoft.svn.core.internal.io.dav.DAVConnection.open(DAVConnection.java:103) at org.tmatesoft.svn.core.internal.io.dav.DAVRepository.openConnection(DAVRepository.java:1018) at org.tmatesoft.svn.core.internal.io.dav.DAVRepository.testConnection(DAVRepository.java:99) at hudson.scm.SubversionSCM$DescriptorImpl.postCredential(SubversionSCM.java:1978) at hudson.scm.SubversionSCM$DescriptorImpl.doPostCredential(SubversionSCM.java:1923) at sun.reflect.NativeMethodAccessorImpl.invoke0(Native Method) at sun.reflect.NativeMethodAccessorImpl.invoke(NativeMethodAccessorImpl.java:39) at sun.reflect.DelegatingMethodAccessorImpl.invoke(DelegatingMethodAccessorImpl.java:25) at java.lang.reflect.Method.invoke(Method.java:597) at org.kohsuke.stapler.Function$InstanceFunction.invoke(Function.java:288) at org.kohsuke.stapler.Function.bindAndInvoke(Function.java:151) at org.kohsuke.stapler.Function.bindAndInvokeAndServeResponse(Function.java:90) at org.kohsuke.stapler.MetaClass$1.doDispatch(MetaClass.java:111) at org.kohsuke.stapler.NameBasedDispatcher.dispatch(NameBasedDispatcher.java:53) at org.kohsuke.stapler.Stapler.tryInvoke(Stapler.java:573) at org.kohsuke.stapler.Stapler.invoke(Stapler.java:658) at org.kohsuke.stapler.MetaClass$6.doDispatch(MetaClass.java:241) at org.kohsuke.stapler.NameBasedDispatcher.dispatch(NameBasedDispatcher.java:53) at org.kohsuke.stapler.Stapler.tryInvoke(Stapler.java:573) at org.kohsuke.stapler.Stapler.invoke(Stapler.java:658) at org.kohsuke.stapler.MetaClass$6.doDispatch(MetaClass.java:241) at org.kohsuke.stapler.NameBasedDispatcher.dispatch(NameBasedDispatcher.java:53) at org.kohsuke.stapler.Stapler.tryInvoke(Stapler.java:573) at org.kohsuke.stapler.Stapler.invoke(Stapler.java:658) at org.kohsuke.stapler.Stapler.invoke(Stapler.java:487) at org.kohsuke.stapler.Stapler.service(Stapler.java:164) at javax.servlet.http.HttpServlet.service(HttpServlet.java:45) at winstone.ServletConfiguration.execute(ServletConfiguration.java:248) at winstone.RequestDispatcher.forward(RequestDispatcher.java:333) at winstone.RequestDispatcher.doFilter(RequestDispatcher.java:376) at hudson.util.PluginServletFilter$1.doFilter(PluginServletFilter.java:95) at hudson.util.PluginServletFilter.doFilter(PluginServletFilter.java:87) at winstone.FilterConfiguration.execute(FilterConfiguration.java:194) at winstone.RequestDispatcher.doFilter(RequestDispatcher.java:366) at hudson.security.csrf.CrumbFilter.doFilter(CrumbFilter.java:47) at winstone.FilterConfiguration.execute(FilterConfiguration.java:194) at winstone.RequestDispatcher.doFilter(RequestDispatcher.java:366) at hudson.security.ChainedServletFilter$1.doFilter(ChainedServletFilter.java:84) at hudson.security.ChainedServletFilter.doFilter(ChainedServletFilter.java:76) at hudson.security.HudsonFilter.doFilter(HudsonFilter.java:164) at winstone.FilterConfiguration.execute(FilterConfiguration.java:194) at winstone.RequestDispatcher.doFilter(RequestDispatcher.java:366) at org.kohsuke.stapler.compression.CompressionFilter.doFilter(CompressionFilter.java:50) at winstone.FilterConfiguration.execute(FilterConfiguration.java:194) at winstone.RequestDispatcher.doFilter(RequestDispatcher.java:366) at hudson.util.CharacterEncodingFilter.doFilter(CharacterEncodingFilter.java:81) at winstone.FilterConfiguration.execute(FilterConfiguration.java:194) at winstone.RequestDispatcher.doFilter(RequestDispatcher.java:366) at winstone.RequestDispatcher.forward(RequestDispatcher.java:331) at winstone.RequestHandlerThread.processRequest(RequestHandlerThread.java:215) at winstone.RequestHandlerThread.run(RequestHandlerThread.java:138) at java.util.concurrent.Executors$RunnableAdapter.call(Executors.java:441) at java.util.concurrent.FutureTask$Sync.innerRun(FutureTask.java:303) at java.util.concurrent.FutureTask.run(FutureTask.java:138) at winstone.BoundedExecutorService$1.run(BoundedExecutorService.java:77) at java.util.concurrent.ThreadPoolExecutor$Worker.runTask(ThreadPoolExecutor.java:886) at java.util.concurrent.ThreadPoolExecutor$Worker.run(ThreadPoolExecutor.java:908) at java.lang.Thread.run(Thread.java:680) Caused by: svn: E175002: OPTIONS /vc/repos failed at org.tmatesoft.svn.core.SVNErrorMessage.create(SVNErrorMessage.java:208) at org.tmatesoft.svn.core.SVNErrorMessage.create(SVNErrorMessage.java:154) at org.tmatesoft.svn.core.SVNErrorMessage.create(SVNErrorMessage.java:97) ... 63 more Caused by: org.tmatesoft.svn.core.SVNException: svn: E175002: OPTIONS request failed on '/vc/repos' svn: E175002: Received fatal alert: bad_record_mac at org.tmatesoft.svn.core.internal.wc.SVNErrorManager.error(SVNErrorManager.java:64) at org.tmatesoft.svn.core.internal.wc.SVNErrorManager.error(SVNErrorManager.java:51) at org.tmatesoft.svn.core.internal.io.dav.http.HTTPConnection._request(HTTPConnection.java:681) at org.tmatesoft.svn.core.internal.io.dav.http.HTTPConnection.request(HTTPConnection.java:298) ... 62 more Caused by: svn: E175002: OPTIONS request failed on '/vc/repos' at org.tmatesoft.svn.core.SVNErrorMessage.create(SVNErrorMessage.java:208) at org.tmatesoft.svn.core.internal.io.dav.http.HTTPConnection._request(HTTPConnection.java:679) ... 63 more Caused by: svn: E175002: Received fatal alert: bad_record_mac at org.tmatesoft.svn.core.SVNErrorMessage.create(SVNErrorMessage.java:109) at org.tmatesoft.svn.core.internal.io.dav.http.HTTPConnection._request(HTTPConnection.java:430) ... 63 more Caused by: javax.net.ssl.SSLException: Received fatal alert: bad_record_mac at com.sun.net.ssl.internal.ssl.Alerts.getSSLException(Alerts.java:190) at com.sun.net.ssl.internal.ssl.Alerts.getSSLException(Alerts.java:136) at com.sun.net.ssl.internal.ssl.SSLSocketImpl.recvAlert(SSLSocketImpl.java:1839) at com.sun.net.ssl.internal.ssl.SSLSocketImpl.readRecord(SSLSocketImpl.java:1019) at com.sun.net.ssl.internal.ssl.SSLSocketImpl.performInitialHandshake(SSLSocketImpl.java:1203) at com.sun.net.ssl.internal.ssl.SSLSocketImpl.writeRecord(SSLSocketImpl.java:654) at com.sun.net.ssl.internal.ssl.AppOutputStream.write(AppOutputStream.java:100) at java.io.BufferedOutputStream.flushBuffer(BufferedOutputStream.java:65) at java.io.BufferedOutputStream.flush(BufferedOutputStream.java:123) at org.tmatesoft.svn.core.internal.io.dav.http.HTTPConnection.sendData(HTTPConnection.java:238) at org.tmatesoft.svn.core.internal.io.dav.http.HTTPRequest.dispatch(HTTPRequest.java:168) at org.tmatesoft.svn.core.internal.io.dav.http.HTTPConnection._request(HTTPConnection.java:385) ... 63 more
            Hide
            hx_unbanned Linards L added a comment -

            Please do full testing on plugin version 1.44. I AM CROSING FINGERS ON THIS ONE...

            Show
            hx_unbanned Linards L added a comment - Please do full testing on plugin version 1.44. I AM CROSING FINGERS ON THIS ONE...
            Hide
            kutzi kutzi added a comment -

            There are no changes regarding this issue in 1.44. See changelog: https://wiki.jenkins-ci.org/display/JENKINS/Subversion+Plugin

            Show
            kutzi kutzi added a comment - There are no changes regarding this issue in 1.44. See changelog: https://wiki.jenkins-ci.org/display/JENKINS/Subversion+Plugin
            Hide
            gerrit Gerrit Telkamp added a comment -

            We had the same problem (Jenkins Ver 1.477, Subversion Plugin 1.42). In our case we were able to solve the problem by increasing the "Keep-Alive" timout of the apache http server, serving the SVN repository (file httpd.conf, default value is 15 sec.)

            It seems to me that the tmatesoft SVN client does not handle the cas of a connection loss correctly in org.tmatesoft.svn.core.internal.io.dav.http.HTTPConnection.request(HTTPConnection.java:304). It might be a good idea to try to re-open the connection again if the http server has closed it unexpectedly.

            See also http://jira.codehaus.org/browse/HAUS-2036

            Show
            gerrit Gerrit Telkamp added a comment - We had the same problem (Jenkins Ver 1.477, Subversion Plugin 1.42). In our case we were able to solve the problem by increasing the "Keep-Alive" timout of the apache http server, serving the SVN repository (file httpd.conf, default value is 15 sec.) It seems to me that the tmatesoft SVN client does not handle the cas of a connection loss correctly in org.tmatesoft.svn.core.internal.io.dav.http.HTTPConnection.request(HTTPConnection.java:304). It might be a good idea to try to re-open the connection again if the http server has closed it unexpectedly. See also http://jira.codehaus.org/browse/HAUS-2036
            Hide
            aeayrs Allan Eayrs added a comment -

            I am seeing this problem as well.
            Jenkins 1.480.1, Subversion Plugin version 1.43

            Show
            aeayrs Allan Eayrs added a comment - I am seeing this problem as well. Jenkins 1.480.1, Subversion Plugin version 1.43
            Hide
            dlavelle dlavelle added a comment -

            I am also seeing this problem.

            Jenkins 1.480.3 LTS, Subversion Plugin version 1.44.

            Does anyone have a fix for this problem? I am not sure updating to Subversion Plugin version 1.45 is going to fix the problem. Our servers are pretty much locked down until we do Quarterly Preventative Maintenance.

            -Dewayne

            Show
            dlavelle dlavelle added a comment - I am also seeing this problem. Jenkins 1.480.3 LTS, Subversion Plugin version 1.44. Does anyone have a fix for this problem? I am not sure updating to Subversion Plugin version 1.45 is going to fix the problem. Our servers are pretty much locked down until we do Quarterly Preventative Maintenance. -Dewayne
            Hide
            pancake pancake added a comment -

            dlavelle, these settings work for us:

            • Jenkins 1.480.3 LTS
            • Subversion Plugin version 1.45
            • Subversion Workspace Version = 1.6 (svn:externals to file)
            • KeepAliveTimeout 60 in httpd.conf

            The only problem that we sometimes experience is this when performing big checkouts (~1.5 Gb, ~40 K files):

            [...truncated 2840 lines...]
            Caused by: svn: E175002: REPORT request failed on '/svn/svnLatest/!svn/vcc/default'
                    at org.tmatesoft.svn.core.SVNErrorMessage.create(SVNErrorMessage.java:208)
                    at org.tmatesoft.svn.core.internal.io.dav.http.HTTPConnection._request(HTTPConnection.java:752)
                    ... 30 more
            Caused by: svn: E175002: Connection reset
                    at org.tmatesoft.svn.core.SVNErrorMessage.create(SVNErrorMessage.java:109)
                    at org.tmatesoft.svn.core.internal.io.dav.http.HTTPConnection._request(HTTPConnection.java:507)
                    ... 30 more
            Caused by: java.net.SocketException: Connection reset
                    at java.net.SocketInputStream.read(Unknown Source)
                    at java.net.SocketInputStream.read(Unknown Source)
                    at java.io.BufferedInputStream.fill(Unknown Source)
                    at java.io.BufferedInputStream.read(Unknown Source)
                    at org.tmatesoft.svn.core.internal.util.ChunkedInputStream.getChunkSizeFromInputStream(ChunkedInputStream.java:111)
                    at org.tmatesoft.svn.core.internal.util.ChunkedInputStream.nextChunk(ChunkedInputStream.java:97)
                    at org.tmatesoft.svn.core.internal.util.ChunkedInputStream.read(ChunkedInputStream.java:69)
                    at sun.nio.cs.StreamDecoder.readBytes(Unknown Source)
                    at sun.nio.cs.StreamDecoder.implRead(Unknown Source)
                    at sun.nio.cs.StreamDecoder.read(Unknown Source)
                    at java.io.InputStreamReader.read(Unknown Source)
                    at org.tmatesoft.svn.core.internal.io.dav.http.XMLReader.read(XMLReader.java:39)
                    at org.apache.xerces.impl.XMLEntityScanner.load(Unknown Source)
                    at org.apache.xerces.impl.XMLEntityScanner.scanContent(Unknown Source)
                    at org.apache.xerces.impl.XMLDocumentFragmentScannerImpl.scanContent(Unknown Source)
                    at org.apache.xerces.impl.XMLDocumentFragmentScannerImpl$FragmentContentDispatcher.dispatch(Unknown Source)
                    at org.apache.xerces.impl.XMLDocumentFragmentScannerImpl.scanDocument(Unknown Source)
                    at org.apache.xerces.parsers.XML11Configuration.parse(Unknown Source)
                    at org.apache.xerces.parsers.XML11Configuration.parse(Unknown Source)
                    at org.apache.xerces.parsers.XMLParser.parse(Unknown Source)
                    at org.apache.xerces.parsers.AbstractSAXParser.parse(Unknown Source)
                    at org.apache.xerces.jaxp.SAXParserImpl$JAXPSAXParser.parse(Unknown Source)
                    at org.tmatesoft.svn.core.internal.io.dav.http.HTTPConnection.readData(HTTPConnection.java:869)
                    at org.tmatesoft.svn.core.internal.io.dav.http.HTTPConnection.readData(HTTPConnection.java:834)
                    at org.tmatesoft.svn.core.internal.io.dav.http.HTTPRequest.dispatch(HTTPRequest.java:218)
                    at org.tmatesoft.svn.core.internal.io.dav.http.HTTPConnection._request(HTTPConnection.java:460)
                    ... 30 more
            FATAL: null
            java.lang.NullPointerException
                    at java.util.ArrayList.addAll(ArrayList.java:530)
                    at hudson.scm.SubversionSCM.checkout(SubversionSCM.java:843)
                    at hudson.scm.SubversionSCM.checkout(SubversionSCM.java:781)
                    at hudson.model.AbstractProject.checkout(AbstractProject.java:1256)
                    at hudson.model.AbstractBuild$AbstractBuildExecution.defaultCheckout(AbstractBuild.java:589)
                    at jenkins.scm.SCMCheckoutStrategy.checkout(SCMCheckoutStrategy.java:88)
                    at hudson.model.AbstractBuild$AbstractBuildExecution.run(AbstractBuild.java:494)
                    at hudson.model.Run.execute(Run.java:1502)
                    at hudson.model.FreeStyleBuild.run(FreeStyleBuild.java:46)
                    at hudson.model.ResourceController.execute(ResourceController.java:88)
                    at hudson.model.Executor.run(Executor.java:236)
            
            Show
            pancake pancake added a comment - dlavelle , these settings work for us: Jenkins 1.480.3 LTS Subversion Plugin version 1.45 Subversion Workspace Version = 1.6 (svn:externals to file) KeepAliveTimeout 60 in httpd.conf The only problem that we sometimes experience is this when performing big checkouts (~1.5 Gb, ~40 K files): [...truncated 2840 lines...] Caused by: svn: E175002: REPORT request failed on '/svn/svnLatest/!svn/vcc/default' at org.tmatesoft.svn.core.SVNErrorMessage.create(SVNErrorMessage.java:208) at org.tmatesoft.svn.core.internal.io.dav.http.HTTPConnection._request(HTTPConnection.java:752) ... 30 more Caused by: svn: E175002: Connection reset at org.tmatesoft.svn.core.SVNErrorMessage.create(SVNErrorMessage.java:109) at org.tmatesoft.svn.core.internal.io.dav.http.HTTPConnection._request(HTTPConnection.java:507) ... 30 more Caused by: java.net.SocketException: Connection reset at java.net.SocketInputStream.read(Unknown Source) at java.net.SocketInputStream.read(Unknown Source) at java.io.BufferedInputStream.fill(Unknown Source) at java.io.BufferedInputStream.read(Unknown Source) at org.tmatesoft.svn.core.internal.util.ChunkedInputStream.getChunkSizeFromInputStream(ChunkedInputStream.java:111) at org.tmatesoft.svn.core.internal.util.ChunkedInputStream.nextChunk(ChunkedInputStream.java:97) at org.tmatesoft.svn.core.internal.util.ChunkedInputStream.read(ChunkedInputStream.java:69) at sun.nio.cs.StreamDecoder.readBytes(Unknown Source) at sun.nio.cs.StreamDecoder.implRead(Unknown Source) at sun.nio.cs.StreamDecoder.read(Unknown Source) at java.io.InputStreamReader.read(Unknown Source) at org.tmatesoft.svn.core.internal.io.dav.http.XMLReader.read(XMLReader.java:39) at org.apache.xerces.impl.XMLEntityScanner.load(Unknown Source) at org.apache.xerces.impl.XMLEntityScanner.scanContent(Unknown Source) at org.apache.xerces.impl.XMLDocumentFragmentScannerImpl.scanContent(Unknown Source) at org.apache.xerces.impl.XMLDocumentFragmentScannerImpl$FragmentContentDispatcher.dispatch(Unknown Source) at org.apache.xerces.impl.XMLDocumentFragmentScannerImpl.scanDocument(Unknown Source) at org.apache.xerces.parsers.XML11Configuration.parse(Unknown Source) at org.apache.xerces.parsers.XML11Configuration.parse(Unknown Source) at org.apache.xerces.parsers.XMLParser.parse(Unknown Source) at org.apache.xerces.parsers.AbstractSAXParser.parse(Unknown Source) at org.apache.xerces.jaxp.SAXParserImpl$JAXPSAXParser.parse(Unknown Source) at org.tmatesoft.svn.core.internal.io.dav.http.HTTPConnection.readData(HTTPConnection.java:869) at org.tmatesoft.svn.core.internal.io.dav.http.HTTPConnection.readData(HTTPConnection.java:834) at org.tmatesoft.svn.core.internal.io.dav.http.HTTPRequest.dispatch(HTTPRequest.java:218) at org.tmatesoft.svn.core.internal.io.dav.http.HTTPConnection._request(HTTPConnection.java:460) ... 30 more FATAL: null java.lang.NullPointerException at java.util.ArrayList.addAll(ArrayList.java:530) at hudson.scm.SubversionSCM.checkout(SubversionSCM.java:843) at hudson.scm.SubversionSCM.checkout(SubversionSCM.java:781) at hudson.model.AbstractProject.checkout(AbstractProject.java:1256) at hudson.model.AbstractBuild$AbstractBuildExecution.defaultCheckout(AbstractBuild.java:589) at jenkins.scm.SCMCheckoutStrategy.checkout(SCMCheckoutStrategy.java:88) at hudson.model.AbstractBuild$AbstractBuildExecution.run(AbstractBuild.java:494) at hudson.model.Run.execute(Run.java:1502) at hudson.model.FreeStyleBuild.run(FreeStyleBuild.java:46) at hudson.model.ResourceController.execute(ResourceController.java:88) at hudson.model.Executor.run(Executor.java:236)
            kutzi kutzi made changes -
            Link This issue is duplicated by JENKINS-15877 [ JENKINS-15877 ]
            christophem christopheM made changes -
            Link This issue is related to JENKINS-13913 [ JENKINS-13913 ]
            Hide
            greghansen Greg Hansen added a comment -

            Jenkins version 1.519
            Jenkins Subversion plugin version 1.50
            CentOS 6.3 x86_64

            ERROR: Failed to check out https://gigasrc.gigamon.com/repos/gv_g/branches/gv_8300/gs
            org.tmatesoft.svn.core.SVNException: svn: E175002: REPORT /repos/!svn/vcc/default failed
            at org.tmatesoft.svn.core.internal.io.dav.http.HTTPConnection.request(HTTPConnection.java:379)
            at org.tmatesoft.svn.core.internal.io.dav.http.HTTPConnection.request(HTTPConnection.java:364)
            at org.tmatesoft.svn.core.internal.io.dav.http.HTTPConnection.request(HTTPConnection.java:352)
            at org.tmatesoft.svn.core.internal.io.dav.DAVConnection.performHttpRequest(DAVConnection.java:708)
            at org.tmatesoft.svn.core.internal.io.dav.DAVConnection.doReport(DAVConnection.java:335)
            at org.tmatesoft.svn.core.internal.io.dav.DAVRepository.runReport(DAVRepository.java:1289)
            at org.tmatesoft.svn.core.internal.io.dav.DAVRepository.update(DAVRepository.java:837)
            at org.tmatesoft.svn.core.internal.wc2.ng.SvnNgAbstractUpdate.updateInternal(SvnNgAbstractUpdate.java:192)
            at org.tmatesoft.svn.core.internal.wc2.ng.SvnNgAbstractUpdate.update(SvnNgAbstractUpdate.java:76)
            at org.tmatesoft.svn.core.internal.wc2.ng.SvnNgAbstractUpdate.checkout(SvnNgAbstractUpdate.java:752)
            at org.tmatesoft.svn.core.internal.wc2.ng.SvnNgCheckout.run(SvnNgCheckout.java:14)
            at org.tmatesoft.svn.core.internal.wc2.ng.SvnNgCheckout.run(SvnNgCheckout.java:9)
            at org.tmatesoft.svn.core.internal.wc2.ng.SvnNgOperationRunner.run(SvnNgOperationRunner.java:20)
            at org.tmatesoft.svn.core.internal.wc2.SvnOperationRunner.run(SvnOperationRunner.java:20)
            at org.tmatesoft.svn.core.wc2.SvnOperationFactory.run(SvnOperationFactory.java:1235)
            at org.tmatesoft.svn.core.wc2.SvnOperation.run(SvnOperation.java:291)
            at org.tmatesoft.svn.core.wc.SVNUpdateClient.doCheckout(SVNUpdateClient.java:777)
            at hudson.scm.subversion.CheckoutUpdater$1.perform(CheckoutUpdater.java:99)
            at hudson.scm.subversion.WorkspaceUpdater$UpdateTask.delegateTo(WorkspaceUpdater.java:153)
            at hudson.scm.SubversionSCM$CheckOutTask.perform(SubversionSCM.java:903)
            at hudson.scm.SubversionSCM$CheckOutTask.invoke(SubversionSCM.java:884)
            at hudson.scm.SubversionSCM$CheckOutTask.invoke(SubversionSCM.java:867)
            at hudson.FilePath$FileCallableWrapper.call(FilePath.java:2388)
            at hudson.remoting.UserRequest.perform(UserRequest.java:118)
            at hudson.remoting.UserRequest.perform(UserRequest.java:48)
            at hudson.remoting.Request$2.run(Request.java:326)
            at hudson.remoting.InterceptingExecutorService$1.call(InterceptingExecutorService.java:72)
            at java.util.concurrent.FutureTask$Sync.innerRun(Unknown Source)
            at java.util.concurrent.FutureTask.run(Unknown Source)
            at java.util.concurrent.ThreadPoolExecutor$Worker.runTask(Unknown Source)
            at java.util.concurrent.ThreadPoolExecutor$Worker.run(Unknown Source)
            at java.lang.Thread.run(Unknown Source)
            Caused by: svn: E175002: REPORT /repos/!svn/vcc/default failed
            at org.tmatesoft.svn.core.SVNErrorMessage.create(SVNErrorMessage.java:208)
            at org.tmatesoft.svn.core.SVNErrorMessage.create(SVNErrorMessage.java:154)
            at org.tmatesoft.svn.core.SVNErrorMessage.create(SVNErrorMessage.java:97)
            ... 32 more
            Caused by: org.tmatesoft.svn.core.SVNException: svn: E175002: REPORT request failed on '/repos/!svn/vcc/default'
            svn: E175002: SSL peer shut down incorrectly
            at org.tmatesoft.svn.core.internal.wc.SVNErrorManager.error(SVNErrorManager.java:64)
            at org.tmatesoft.svn.core.internal.wc.SVNErrorManager.error(SVNErrorManager.java:51)
            at org.tmatesoft.svn.core.internal.io.dav.http.HTTPConnection._request(HTTPConnection.java:754)
            at org.tmatesoft.svn.core.internal.io.dav.http.HTTPConnection.request(HTTPConnection.java:373)
            ... 31 more
            Caused by: svn: E175002: REPORT request failed on '/repos/!svn/vcc/default'
            at org.tmatesoft.svn.core.SVNErrorMessage.create(SVNErrorMessage.java:208)
            at org.tmatesoft.svn.core.internal.io.dav.http.HTTPConnection._request(HTTPConnection.java:752)
            ... 32 more
            Caused by: svn: E175002: SSL peer shut down incorrectly
            at org.tmatesoft.svn.core.SVNErrorMessage.create(SVNErrorMessage.java:109)
            at org.tmatesoft.svn.core.internal.io.dav.http.HTTPConnection._request(HTTPConnection.java:505)
            ... 32 more
            Caused by: javax.net.ssl.SSLException: SSL peer shut down incorrectly
            at com.sun.net.ssl.internal.ssl.InputRecord.readV3Record(Unknown Source)
            at com.sun.net.ssl.internal.ssl.InputRecord.read(Unknown Source)
            at com.sun.net.ssl.internal.ssl.SSLSocketImpl.readRecord(Unknown Source)
            at com.sun.net.ssl.internal.ssl.SSLSocketImpl.readDataRecord(Unknown Source)
            at com.sun.net.ssl.internal.ssl.AppInputStream.read(Unknown Source)
            at java.io.BufferedInputStream.read1(Unknown Source)
            at java.io.BufferedInputStream.read(Unknown Source)
            at org.tmatesoft.svn.core.internal.util.ChunkedInputStream.read(ChunkedInputStream.java:75)
            at sun.nio.cs.StreamDecoder.readBytes(Unknown Source)
            at sun.nio.cs.StreamDecoder.implRead(Unknown Source)
            at sun.nio.cs.StreamDecoder.read(Unknown Source)
            at java.io.InputStreamReader.read(Unknown Source)
            at org.tmatesoft.svn.core.internal.io.dav.http.XMLReader.read(XMLReader.java:39)
            at com.sun.org.apache.xerces.internal.impl.XMLEntityScanner.load(Unknown Source)
            at com.sun.org.apache.xerces.internal.impl.XMLEntityScanner.skipChar(Unknown Source)
            at com.sun.org.apache.xerces.internal.impl.XMLDocumentFragmentScannerImpl$FragmentContentDriver.next(Unknown Source)
            at com.sun.org.apache.xerces.internal.impl.XMLDocumentScannerImpl.next(Unknown Source)
            at com.sun.org.apache.xerces.internal.impl.XMLNSDocumentScannerImpl.next(Unknown Source)
            at com.sun.org.apache.xerces.internal.impl.XMLDocumentFragmentScannerImpl.scanDocument(Unknown Source)
            at com.sun.org.apache.xerces.internal.parsers.XML11Configuration.parse(Unknown Source)
            at com.sun.org.apache.xerces.internal.parsers.XML11Configuration.parse(Unknown Source)
            at com.sun.org.apache.xerces.internal.parsers.XMLParser.parse(Unknown Source)
            at com.sun.org.apache.xerces.internal.parsers.AbstractSAXParser.parse(Unknown Source)
            at com.sun.org.apache.xerces.internal.jaxp.SAXParserImpl$JAXPSAXParser.parse(Unknown Source)
            at org.tmatesoft.svn.core.internal.io.dav.http.HTTPConnection.readData(HTTPConnection.java:869)
            at org.tmatesoft.svn.core.internal.io.dav.http.HTTPConnection.readData(HTTPConnection.java:834)
            at org.tmatesoft.svn.core.internal.io.dav.http.HTTPRequest.dispatch(HTTPRequest.java:218)
            at org.tmatesoft.svn.core.internal.io.dav.http.HTTPConnection._request(HTTPConnection.java:460)
            ... 32 more
            hudson.util.IOException2: remote file operation failed: /var/jenkins/workspace/GS_8300 at hudson.remoting.Channel@25d8a8b:jenkins-slave003
            at hudson.FilePath.act(FilePath.java:901)
            at hudson.FilePath.act(FilePath.java:878)
            at hudson.scm.SubversionSCM.checkout(SubversionSCM.java:843)
            at hudson.scm.SubversionSCM.checkout(SubversionSCM.java:781)
            at hudson.model.AbstractProject.checkout(AbstractProject.java:1369)
            at hudson.model.AbstractBuild$AbstractBuildExecution.defaultCheckout(AbstractBuild.java:676)
            at jenkins.scm.SCMCheckoutStrategy.checkout(SCMCheckoutStrategy.java:88)
            at hudson.model.AbstractBuild$AbstractBuildExecution.run(AbstractBuild.java:581)
            at hudson.model.Run.execute(Run.java:1593)
            at hudson.model.FreeStyleBuild.run(FreeStyleBuild.java:46)
            at hudson.model.ResourceController.execute(ResourceController.java:88)
            at hudson.model.Executor.run(Executor.java:242)
            Caused by: java.io.IOException: Failed to check out https://gigasrc.gigamon.com/repos/gv_g/branches/gv_8300/gs
            at hudson.scm.subversion.CheckoutUpdater$1.perform(CheckoutUpdater.java:110)
            at hudson.scm.subversion.WorkspaceUpdater$UpdateTask.delegateTo(WorkspaceUpdater.java:153)
            at hudson.scm.SubversionSCM$CheckOutTask.perform(SubversionSCM.java:903)
            at hudson.scm.SubversionSCM$CheckOutTask.invoke(SubversionSCM.java:884)
            at hudson.scm.SubversionSCM$CheckOutTask.invoke(SubversionSCM.java:867)
            at hudson.FilePath$FileCallableWrapper.call(FilePath.java:2388)
            at hudson.remoting.UserRequest.perform(UserRequest.java:118)
            at hudson.remoting.UserRequest.perform(UserRequest.java:48)
            at hudson.remoting.Request$2.run(Request.java:326)
            at hudson.remoting.InterceptingExecutorService$1.call(InterceptingExecutorService.java:72)
            at java.util.concurrent.FutureTask$Sync.innerRun(Unknown Source)
            at java.util.concurrent.FutureTask.run(Unknown Source)
            at java.util.concurrent.ThreadPoolExecutor$Worker.runTask(Unknown Source)
            at java.util.concurrent.ThreadPoolExecutor$Worker.run(Unknown Source)
            at java.lang.Thread.run(Unknown Source)
            Caused by: org.tmatesoft.svn.core.SVNException: svn: E175002: REPORT /repos/!svn/vcc/default failed
            at org.tmatesoft.svn.core.internal.io.dav.http.HTTPConnection.request(HTTPConnection.java:379)
            at org.tmatesoft.svn.core.internal.io.dav.http.HTTPConnection.request(HTTPConnection.java:364)
            at org.tmatesoft.svn.core.internal.io.dav.http.HTTPConnection.request(HTTPConnection.java:352)
            at org.tmatesoft.svn.core.internal.io.dav.DAVConnection.performHttpRequest(DAVConnection.java:708)
            at org.tmatesoft.svn.core.internal.io.dav.DAVConnection.doReport(DAVConnection.java:335)
            at org.tmatesoft.svn.core.internal.io.dav.DAVRepository.runReport(DAVRepository.java:1289)
            at org.tmatesoft.svn.core.internal.io.dav.DAVRepository.update(DAVRepository.java:837)
            at org.tmatesoft.svn.core.internal.wc2.ng.SvnNgAbstractUpdate.updateInternal(SvnNgAbstractUpdate.java:192)
            at org.tmatesoft.svn.core.internal.wc2.ng.SvnNgAbstractUpdate.update(SvnNgAbstractUpdate.java:76)
            at org.tmatesoft.svn.core.internal.wc2.ng.SvnNgAbstractUpdate.checkout(SvnNgAbstractUpdate.java:752)
            at org.tmatesoft.svn.core.internal.wc2.ng.SvnNgCheckout.run(SvnNgCheckout.java:14)
            at org.tmatesoft.svn.core.internal.wc2.ng.SvnNgCheckout.run(SvnNgCheckout.java:9)
            at org.tmatesoft.svn.core.internal.wc2.ng.SvnNgOperationRunner.run(SvnNgOperationRunner.java:20)
            at org.tmatesoft.svn.core.internal.wc2.SvnOperationRunner.run(SvnOperationRunner.java:20)
            at org.tmatesoft.svn.core.wc2.SvnOperationFactory.run(SvnOperationFactory.java:1235)
            at org.tmatesoft.svn.core.wc2.SvnOperation.run(SvnOperation.java:291)
            at org.tmatesoft.svn.core.wc.SVNUpdateClient.doCheckout(SVNUpdateClient.java:777)
            at hudson.scm.subversion.CheckoutUpdater$1.perform(CheckoutUpdater.java:99)
            ... 14 more
            Caused by: svn: E175002: REPORT /repos/!svn/vcc/default failed
            at org.tmatesoft.svn.core.SVNErrorMessage.create(SVNErrorMessage.java:208)
            at org.tmatesoft.svn.core.SVNErrorMessage.create(SVNErrorMessage.java:154)
            at org.tmatesoft.svn.core.SVNErrorMessage.create(SVNErrorMessage.java:97)
            ... 32 more
            Caused by: org.tmatesoft.svn.core.SVNException: svn: E175002: REPORT request failed on '/repos/!svn/vcc/default'
            svn: E175002: SSL peer shut down incorrectly
            at org.tmatesoft.svn.core.internal.wc.SVNErrorManager.error(SVNErrorManager.java:64)
            at org.tmatesoft.svn.core.internal.wc.SVNErrorManager.error(SVNErrorManager.java:51)
            at org.tmatesoft.svn.core.internal.io.dav.http.HTTPConnection._request(HTTPConnection.java:754)
            at org.tmatesoft.svn.core.internal.io.dav.http.HTTPConnection.request(HTTPConnection.java:373)
            ... 31 more
            Caused by: svn: E175002: REPORT request failed on '/repos/!svn/vcc/default'
            at org.tmatesoft.svn.core.SVNErrorMessage.create(SVNErrorMessage.java:208)
            at org.tmatesoft.svn.core.internal.io.dav.http.HTTPConnection._request(HTTPConnection.java:752)
            ... 32 more
            Caused by: svn: E175002: SSL peer shut down incorrectly
            at org.tmatesoft.svn.core.SVNErrorMessage.create(SVNErrorMessage.java:109)
            at org.tmatesoft.svn.core.internal.io.dav.http.HTTPConnection._request(HTTPConnection.java:505)
            ... 32 more
            Caused by: javax.net.ssl.SSLException: SSL peer shut down incorrectly
            at com.sun.net.ssl.internal.ssl.InputRecord.readV3Record(Unknown Source)
            at com.sun.net.ssl.internal.ssl.InputRecord.read(Unknown Source)
            at com.sun.net.ssl.internal.ssl.SSLSocketImpl.readRecord(Unknown Source)
            at com.sun.net.ssl.internal.ssl.SSLSocketImpl.readDataRecord(Unknown Source)
            at com.sun.net.ssl.internal.ssl.AppInputStream.read(Unknown Source)
            at java.io.BufferedInputStream.read1(Unknown Source)
            at java.io.BufferedInputStream.read(Unknown Source)
            at org.tmatesoft.svn.core.internal.util.ChunkedInputStream.read(ChunkedInputStream.java:75)
            at sun.nio.cs.StreamDecoder.readBytes(Unknown Source)
            at sun.nio.cs.StreamDecoder.implRead(Unknown Source)
            at sun.nio.cs.StreamDecoder.read(Unknown Source)
            at java.io.InputStreamReader.read(Unknown Source)
            at org.tmatesoft.svn.core.internal.io.dav.http.XMLReader.read(XMLReader.java:39)
            at com.sun.org.apache.xerces.internal.impl.XMLEntityScanner.load(Unknown Source)
            at com.sun.org.apache.xerces.internal.impl.XMLEntityScanner.skipChar(Unknown Source)
            at com.sun.org.apache.xerces.internal.impl.XMLDocumentFragmentScannerImpl$FragmentContentDriver.next(Unknown Source)
            at com.sun.org.apache.xerces.internal.impl.XMLDocumentScannerImpl.next(Unknown Source)
            at com.sun.org.apache.xerces.internal.impl.XMLNSDocumentScannerImpl.next(Unknown Source)
            at com.sun.org.apache.xerces.internal.impl.XMLDocumentFragmentScannerImpl.scanDocument(Unknown Source)
            at com.sun.org.apache.xerces.internal.parsers.XML11Configuration.parse(Unknown Source)
            at com.sun.org.apache.xerces.internal.parsers.XML11Configuration.parse(Unknown Source)
            at com.sun.org.apache.xerces.internal.parsers.XMLParser.parse(Unknown Source)
            at com.sun.org.apache.xerces.internal.parsers.AbstractSAXParser.parse(Unknown Source)
            at com.sun.org.apache.xerces.internal.jaxp.SAXParserImpl$JAXPSAXParser.parse(Unknown Source)
            at org.tmatesoft.svn.core.internal.io.dav.http.HTTPConnection.readData(HTTPConnection.java:869)
            at org.tmatesoft.svn.core.internal.io.dav.http.HTTPConnection.readData(HTTPConnection.java:834)
            at org.tmatesoft.svn.core.internal.io.dav.http.HTTPRequest.dispatch(HTTPRequest.java:218)
            at org.tmatesoft.svn.core.internal.io.dav.http.HTTPConnection._request(HTTPConnection.java:460)
            ... 32 more

            Show
            greghansen Greg Hansen added a comment - Jenkins version 1.519 Jenkins Subversion plugin version 1.50 CentOS 6.3 x86_64 ERROR: Failed to check out https://gigasrc.gigamon.com/repos/gv_g/branches/gv_8300/gs org.tmatesoft.svn.core.SVNException: svn: E175002: REPORT /repos/!svn/vcc/default failed at org.tmatesoft.svn.core.internal.io.dav.http.HTTPConnection.request(HTTPConnection.java:379) at org.tmatesoft.svn.core.internal.io.dav.http.HTTPConnection.request(HTTPConnection.java:364) at org.tmatesoft.svn.core.internal.io.dav.http.HTTPConnection.request(HTTPConnection.java:352) at org.tmatesoft.svn.core.internal.io.dav.DAVConnection.performHttpRequest(DAVConnection.java:708) at org.tmatesoft.svn.core.internal.io.dav.DAVConnection.doReport(DAVConnection.java:335) at org.tmatesoft.svn.core.internal.io.dav.DAVRepository.runReport(DAVRepository.java:1289) at org.tmatesoft.svn.core.internal.io.dav.DAVRepository.update(DAVRepository.java:837) at org.tmatesoft.svn.core.internal.wc2.ng.SvnNgAbstractUpdate.updateInternal(SvnNgAbstractUpdate.java:192) at org.tmatesoft.svn.core.internal.wc2.ng.SvnNgAbstractUpdate.update(SvnNgAbstractUpdate.java:76) at org.tmatesoft.svn.core.internal.wc2.ng.SvnNgAbstractUpdate.checkout(SvnNgAbstractUpdate.java:752) at org.tmatesoft.svn.core.internal.wc2.ng.SvnNgCheckout.run(SvnNgCheckout.java:14) at org.tmatesoft.svn.core.internal.wc2.ng.SvnNgCheckout.run(SvnNgCheckout.java:9) at org.tmatesoft.svn.core.internal.wc2.ng.SvnNgOperationRunner.run(SvnNgOperationRunner.java:20) at org.tmatesoft.svn.core.internal.wc2.SvnOperationRunner.run(SvnOperationRunner.java:20) at org.tmatesoft.svn.core.wc2.SvnOperationFactory.run(SvnOperationFactory.java:1235) at org.tmatesoft.svn.core.wc2.SvnOperation.run(SvnOperation.java:291) at org.tmatesoft.svn.core.wc.SVNUpdateClient.doCheckout(SVNUpdateClient.java:777) at hudson.scm.subversion.CheckoutUpdater$1.perform(CheckoutUpdater.java:99) at hudson.scm.subversion.WorkspaceUpdater$UpdateTask.delegateTo(WorkspaceUpdater.java:153) at hudson.scm.SubversionSCM$CheckOutTask.perform(SubversionSCM.java:903) at hudson.scm.SubversionSCM$CheckOutTask.invoke(SubversionSCM.java:884) at hudson.scm.SubversionSCM$CheckOutTask.invoke(SubversionSCM.java:867) at hudson.FilePath$FileCallableWrapper.call(FilePath.java:2388) at hudson.remoting.UserRequest.perform(UserRequest.java:118) at hudson.remoting.UserRequest.perform(UserRequest.java:48) at hudson.remoting.Request$2.run(Request.java:326) at hudson.remoting.InterceptingExecutorService$1.call(InterceptingExecutorService.java:72) at java.util.concurrent.FutureTask$Sync.innerRun(Unknown Source) at java.util.concurrent.FutureTask.run(Unknown Source) at java.util.concurrent.ThreadPoolExecutor$Worker.runTask(Unknown Source) at java.util.concurrent.ThreadPoolExecutor$Worker.run(Unknown Source) at java.lang.Thread.run(Unknown Source) Caused by: svn: E175002: REPORT /repos/!svn/vcc/default failed at org.tmatesoft.svn.core.SVNErrorMessage.create(SVNErrorMessage.java:208) at org.tmatesoft.svn.core.SVNErrorMessage.create(SVNErrorMessage.java:154) at org.tmatesoft.svn.core.SVNErrorMessage.create(SVNErrorMessage.java:97) ... 32 more Caused by: org.tmatesoft.svn.core.SVNException: svn: E175002: REPORT request failed on '/repos/!svn/vcc/default' svn: E175002: SSL peer shut down incorrectly at org.tmatesoft.svn.core.internal.wc.SVNErrorManager.error(SVNErrorManager.java:64) at org.tmatesoft.svn.core.internal.wc.SVNErrorManager.error(SVNErrorManager.java:51) at org.tmatesoft.svn.core.internal.io.dav.http.HTTPConnection._request(HTTPConnection.java:754) at org.tmatesoft.svn.core.internal.io.dav.http.HTTPConnection.request(HTTPConnection.java:373) ... 31 more Caused by: svn: E175002: REPORT request failed on '/repos/!svn/vcc/default' at org.tmatesoft.svn.core.SVNErrorMessage.create(SVNErrorMessage.java:208) at org.tmatesoft.svn.core.internal.io.dav.http.HTTPConnection._request(HTTPConnection.java:752) ... 32 more Caused by: svn: E175002: SSL peer shut down incorrectly at org.tmatesoft.svn.core.SVNErrorMessage.create(SVNErrorMessage.java:109) at org.tmatesoft.svn.core.internal.io.dav.http.HTTPConnection._request(HTTPConnection.java:505) ... 32 more Caused by: javax.net.ssl.SSLException: SSL peer shut down incorrectly at com.sun.net.ssl.internal.ssl.InputRecord.readV3Record(Unknown Source) at com.sun.net.ssl.internal.ssl.InputRecord.read(Unknown Source) at com.sun.net.ssl.internal.ssl.SSLSocketImpl.readRecord(Unknown Source) at com.sun.net.ssl.internal.ssl.SSLSocketImpl.readDataRecord(Unknown Source) at com.sun.net.ssl.internal.ssl.AppInputStream.read(Unknown Source) at java.io.BufferedInputStream.read1(Unknown Source) at java.io.BufferedInputStream.read(Unknown Source) at org.tmatesoft.svn.core.internal.util.ChunkedInputStream.read(ChunkedInputStream.java:75) at sun.nio.cs.StreamDecoder.readBytes(Unknown Source) at sun.nio.cs.StreamDecoder.implRead(Unknown Source) at sun.nio.cs.StreamDecoder.read(Unknown Source) at java.io.InputStreamReader.read(Unknown Source) at org.tmatesoft.svn.core.internal.io.dav.http.XMLReader.read(XMLReader.java:39) at com.sun.org.apache.xerces.internal.impl.XMLEntityScanner.load(Unknown Source) at com.sun.org.apache.xerces.internal.impl.XMLEntityScanner.skipChar(Unknown Source) at com.sun.org.apache.xerces.internal.impl.XMLDocumentFragmentScannerImpl$FragmentContentDriver.next(Unknown Source) at com.sun.org.apache.xerces.internal.impl.XMLDocumentScannerImpl.next(Unknown Source) at com.sun.org.apache.xerces.internal.impl.XMLNSDocumentScannerImpl.next(Unknown Source) at com.sun.org.apache.xerces.internal.impl.XMLDocumentFragmentScannerImpl.scanDocument(Unknown Source) at com.sun.org.apache.xerces.internal.parsers.XML11Configuration.parse(Unknown Source) at com.sun.org.apache.xerces.internal.parsers.XML11Configuration.parse(Unknown Source) at com.sun.org.apache.xerces.internal.parsers.XMLParser.parse(Unknown Source) at com.sun.org.apache.xerces.internal.parsers.AbstractSAXParser.parse(Unknown Source) at com.sun.org.apache.xerces.internal.jaxp.SAXParserImpl$JAXPSAXParser.parse(Unknown Source) at org.tmatesoft.svn.core.internal.io.dav.http.HTTPConnection.readData(HTTPConnection.java:869) at org.tmatesoft.svn.core.internal.io.dav.http.HTTPConnection.readData(HTTPConnection.java:834) at org.tmatesoft.svn.core.internal.io.dav.http.HTTPRequest.dispatch(HTTPRequest.java:218) at org.tmatesoft.svn.core.internal.io.dav.http.HTTPConnection._request(HTTPConnection.java:460) ... 32 more hudson.util.IOException2: remote file operation failed: /var/jenkins/workspace/GS_8300 at hudson.remoting.Channel@25d8a8b:jenkins-slave003 at hudson.FilePath.act(FilePath.java:901) at hudson.FilePath.act(FilePath.java:878) at hudson.scm.SubversionSCM.checkout(SubversionSCM.java:843) at hudson.scm.SubversionSCM.checkout(SubversionSCM.java:781) at hudson.model.AbstractProject.checkout(AbstractProject.java:1369) at hudson.model.AbstractBuild$AbstractBuildExecution.defaultCheckout(AbstractBuild.java:676) at jenkins.scm.SCMCheckoutStrategy.checkout(SCMCheckoutStrategy.java:88) at hudson.model.AbstractBuild$AbstractBuildExecution.run(AbstractBuild.java:581) at hudson.model.Run.execute(Run.java:1593) at hudson.model.FreeStyleBuild.run(FreeStyleBuild.java:46) at hudson.model.ResourceController.execute(ResourceController.java:88) at hudson.model.Executor.run(Executor.java:242) Caused by: java.io.IOException: Failed to check out https://gigasrc.gigamon.com/repos/gv_g/branches/gv_8300/gs at hudson.scm.subversion.CheckoutUpdater$1.perform(CheckoutUpdater.java:110) at hudson.scm.subversion.WorkspaceUpdater$UpdateTask.delegateTo(WorkspaceUpdater.java:153) at hudson.scm.SubversionSCM$CheckOutTask.perform(SubversionSCM.java:903) at hudson.scm.SubversionSCM$CheckOutTask.invoke(SubversionSCM.java:884) at hudson.scm.SubversionSCM$CheckOutTask.invoke(SubversionSCM.java:867) at hudson.FilePath$FileCallableWrapper.call(FilePath.java:2388) at hudson.remoting.UserRequest.perform(UserRequest.java:118) at hudson.remoting.UserRequest.perform(UserRequest.java:48) at hudson.remoting.Request$2.run(Request.java:326) at hudson.remoting.InterceptingExecutorService$1.call(InterceptingExecutorService.java:72) at java.util.concurrent.FutureTask$Sync.innerRun(Unknown Source) at java.util.concurrent.FutureTask.run(Unknown Source) at java.util.concurrent.ThreadPoolExecutor$Worker.runTask(Unknown Source) at java.util.concurrent.ThreadPoolExecutor$Worker.run(Unknown Source) at java.lang.Thread.run(Unknown Source) Caused by: org.tmatesoft.svn.core.SVNException: svn: E175002: REPORT /repos/!svn/vcc/default failed at org.tmatesoft.svn.core.internal.io.dav.http.HTTPConnection.request(HTTPConnection.java:379) at org.tmatesoft.svn.core.internal.io.dav.http.HTTPConnection.request(HTTPConnection.java:364) at org.tmatesoft.svn.core.internal.io.dav.http.HTTPConnection.request(HTTPConnection.java:352) at org.tmatesoft.svn.core.internal.io.dav.DAVConnection.performHttpRequest(DAVConnection.java:708) at org.tmatesoft.svn.core.internal.io.dav.DAVConnection.doReport(DAVConnection.java:335) at org.tmatesoft.svn.core.internal.io.dav.DAVRepository.runReport(DAVRepository.java:1289) at org.tmatesoft.svn.core.internal.io.dav.DAVRepository.update(DAVRepository.java:837) at org.tmatesoft.svn.core.internal.wc2.ng.SvnNgAbstractUpdate.updateInternal(SvnNgAbstractUpdate.java:192) at org.tmatesoft.svn.core.internal.wc2.ng.SvnNgAbstractUpdate.update(SvnNgAbstractUpdate.java:76) at org.tmatesoft.svn.core.internal.wc2.ng.SvnNgAbstractUpdate.checkout(SvnNgAbstractUpdate.java:752) at org.tmatesoft.svn.core.internal.wc2.ng.SvnNgCheckout.run(SvnNgCheckout.java:14) at org.tmatesoft.svn.core.internal.wc2.ng.SvnNgCheckout.run(SvnNgCheckout.java:9) at org.tmatesoft.svn.core.internal.wc2.ng.SvnNgOperationRunner.run(SvnNgOperationRunner.java:20) at org.tmatesoft.svn.core.internal.wc2.SvnOperationRunner.run(SvnOperationRunner.java:20) at org.tmatesoft.svn.core.wc2.SvnOperationFactory.run(SvnOperationFactory.java:1235) at org.tmatesoft.svn.core.wc2.SvnOperation.run(SvnOperation.java:291) at org.tmatesoft.svn.core.wc.SVNUpdateClient.doCheckout(SVNUpdateClient.java:777) at hudson.scm.subversion.CheckoutUpdater$1.perform(CheckoutUpdater.java:99) ... 14 more Caused by: svn: E175002: REPORT /repos/!svn/vcc/default failed at org.tmatesoft.svn.core.SVNErrorMessage.create(SVNErrorMessage.java:208) at org.tmatesoft.svn.core.SVNErrorMessage.create(SVNErrorMessage.java:154) at org.tmatesoft.svn.core.SVNErrorMessage.create(SVNErrorMessage.java:97) ... 32 more Caused by: org.tmatesoft.svn.core.SVNException: svn: E175002: REPORT request failed on '/repos/!svn/vcc/default' svn: E175002: SSL peer shut down incorrectly at org.tmatesoft.svn.core.internal.wc.SVNErrorManager.error(SVNErrorManager.java:64) at org.tmatesoft.svn.core.internal.wc.SVNErrorManager.error(SVNErrorManager.java:51) at org.tmatesoft.svn.core.internal.io.dav.http.HTTPConnection._request(HTTPConnection.java:754) at org.tmatesoft.svn.core.internal.io.dav.http.HTTPConnection.request(HTTPConnection.java:373) ... 31 more Caused by: svn: E175002: REPORT request failed on '/repos/!svn/vcc/default' at org.tmatesoft.svn.core.SVNErrorMessage.create(SVNErrorMessage.java:208) at org.tmatesoft.svn.core.internal.io.dav.http.HTTPConnection._request(HTTPConnection.java:752) ... 32 more Caused by: svn: E175002: SSL peer shut down incorrectly at org.tmatesoft.svn.core.SVNErrorMessage.create(SVNErrorMessage.java:109) at org.tmatesoft.svn.core.internal.io.dav.http.HTTPConnection._request(HTTPConnection.java:505) ... 32 more Caused by: javax.net.ssl.SSLException: SSL peer shut down incorrectly at com.sun.net.ssl.internal.ssl.InputRecord.readV3Record(Unknown Source) at com.sun.net.ssl.internal.ssl.InputRecord.read(Unknown Source) at com.sun.net.ssl.internal.ssl.SSLSocketImpl.readRecord(Unknown Source) at com.sun.net.ssl.internal.ssl.SSLSocketImpl.readDataRecord(Unknown Source) at com.sun.net.ssl.internal.ssl.AppInputStream.read(Unknown Source) at java.io.BufferedInputStream.read1(Unknown Source) at java.io.BufferedInputStream.read(Unknown Source) at org.tmatesoft.svn.core.internal.util.ChunkedInputStream.read(ChunkedInputStream.java:75) at sun.nio.cs.StreamDecoder.readBytes(Unknown Source) at sun.nio.cs.StreamDecoder.implRead(Unknown Source) at sun.nio.cs.StreamDecoder.read(Unknown Source) at java.io.InputStreamReader.read(Unknown Source) at org.tmatesoft.svn.core.internal.io.dav.http.XMLReader.read(XMLReader.java:39) at com.sun.org.apache.xerces.internal.impl.XMLEntityScanner.load(Unknown Source) at com.sun.org.apache.xerces.internal.impl.XMLEntityScanner.skipChar(Unknown Source) at com.sun.org.apache.xerces.internal.impl.XMLDocumentFragmentScannerImpl$FragmentContentDriver.next(Unknown Source) at com.sun.org.apache.xerces.internal.impl.XMLDocumentScannerImpl.next(Unknown Source) at com.sun.org.apache.xerces.internal.impl.XMLNSDocumentScannerImpl.next(Unknown Source) at com.sun.org.apache.xerces.internal.impl.XMLDocumentFragmentScannerImpl.scanDocument(Unknown Source) at com.sun.org.apache.xerces.internal.parsers.XML11Configuration.parse(Unknown Source) at com.sun.org.apache.xerces.internal.parsers.XML11Configuration.parse(Unknown Source) at com.sun.org.apache.xerces.internal.parsers.XMLParser.parse(Unknown Source) at com.sun.org.apache.xerces.internal.parsers.AbstractSAXParser.parse(Unknown Source) at com.sun.org.apache.xerces.internal.jaxp.SAXParserImpl$JAXPSAXParser.parse(Unknown Source) at org.tmatesoft.svn.core.internal.io.dav.http.HTTPConnection.readData(HTTPConnection.java:869) at org.tmatesoft.svn.core.internal.io.dav.http.HTTPConnection.readData(HTTPConnection.java:834) at org.tmatesoft.svn.core.internal.io.dav.http.HTTPRequest.dispatch(HTTPRequest.java:218) at org.tmatesoft.svn.core.internal.io.dav.http.HTTPConnection._request(HTTPConnection.java:460) ... 32 more
            Hide
            greghansen Greg Hansen added a comment - - edited

            Just tried this with a new installation of the latest version of Subversion server (1.8) on a freshly-installed machine running CentOS 6.3, and get the same error. We tried increasing the "KeepAlive" timeout from 15 seconds to 60 seconds (restarted both httpd and jenkins), but still observed the issue.

            Show
            greghansen Greg Hansen added a comment - - edited Just tried this with a new installation of the latest version of Subversion server (1.8) on a freshly-installed machine running CentOS 6.3, and get the same error. We tried increasing the "KeepAlive" timeout from 15 seconds to 60 seconds (restarted both httpd and jenkins), but still observed the issue.
            Hide
            pancake pancake added a comment -

            Greg, it should be minutes or even tens of minutes (depends on WC size and hardware of the box that performs the checkout).
            Jenkins' KeepAlive has nothing to do with the problem.

            Show
            pancake pancake added a comment - Greg , it should be minutes or even tens of minutes (depends on WC size and hardware of the box that performs the checkout). Jenkins' KeepAlive has nothing to do with the problem.
            Hide
            greghansen Greg Hansen added a comment -

            I'm grasping at anything that might alleviate the situation. Configuring httpd to maintain an established connection for a while to see if there was any more activity that could be sent across it before dismantling sounded like a reasonable thing to try.

            From the experiment where I ran the same check-outs against both a revision 1.6 repo and a newly-installed 1.8 repo (Dell R620, two six-core processors, 32 GB RAM, 10K RPM SAS drives, CentOS 6.3), the fact that the problem occurs on both repos suggests that the problem is not on the Subversion side – it's on the Jenkins server side. Anyone with suggestions about Jenkins or CentOS configuration that might help this, please speak up! It's killing one or two out of 23 builds every day.

            Show
            greghansen Greg Hansen added a comment - I'm grasping at anything that might alleviate the situation. Configuring httpd to maintain an established connection for a while to see if there was any more activity that could be sent across it before dismantling sounded like a reasonable thing to try. From the experiment where I ran the same check-outs against both a revision 1.6 repo and a newly-installed 1.8 repo (Dell R620, two six-core processors, 32 GB RAM, 10K RPM SAS drives, CentOS 6.3), the fact that the problem occurs on both repos suggests that the problem is not on the Subversion side – it's on the Jenkins server side. Anyone with suggestions about Jenkins or CentOS configuration that might help this, please speak up! It's killing one or two out of 23 builds every day.
            Hide
            greghansen Greg Hansen added a comment -

            I bumped the timeout to five minutes, and now ten. We'll see if that helps.

            Show
            greghansen Greg Hansen added a comment - I bumped the timeout to five minutes, and now ten. We'll see if that helps.
            Hide
            pancake pancake added a comment -

            Greg, the problem is indeed on the Jenkins side. Not necessarily on Jenkins server itself. Basically speaking this glitch occurs when svn client (Jenkins server or slave) stops communicating to svn server for unexpectedly long time (>KeepAlive). In our Jenkins deployment we saw that svn checkout on slave consumed 100% of one CPU core, i.e. checkout speed was limited by per-core performance of Jenkins node. So, to workaround the alleviate the situation you can:

            • See if CPU/disk performance is a bottleneck for svn checkout and upgrade the hardware of relevant Jenkins node.
            • Tune Jenkins GC options. We didn't check, but it's very likely that delays are due to GC.
            • Increase KeepAlive on svn server. You'll probably want to setup a dedicated svn mirror for Jenkins and set KeepAlive on that mirror only. That's not good to have insanely big KeepAlive on a publicly available servers.

            Note that we're using 1.6 WC format on Jenkins ("Manage Jenkins" -> "Configure System" -> "Subversion"). I don't quite remember what exactly bug made us downgrade 1.7 -> 1.6 and not even sure if it's still there. But you can try it if the above doesn't help.

            Show
            pancake pancake added a comment - Greg , the problem is indeed on the Jenkins side. Not necessarily on Jenkins server itself. Basically speaking this glitch occurs when svn client (Jenkins server or slave) stops communicating to svn server for unexpectedly long time (>KeepAlive). In our Jenkins deployment we saw that svn checkout on slave consumed 100% of one CPU core, i.e. checkout speed was limited by per-core performance of Jenkins node. So, to workaround the alleviate the situation you can: See if CPU/disk performance is a bottleneck for svn checkout and upgrade the hardware of relevant Jenkins node. Tune Jenkins GC options. We didn't check, but it's very likely that delays are due to GC. Increase KeepAlive on svn server. You'll probably want to setup a dedicated svn mirror for Jenkins and set KeepAlive on that mirror only. That's not good to have insanely big KeepAlive on a publicly available servers. Note that we're using 1.6 WC format on Jenkins ("Manage Jenkins" -> "Configure System" -> "Subversion"). I don't quite remember what exactly bug made us downgrade 1.7 -> 1.6 and not even sure if it's still there. But you can try it if the above doesn't help.
            Hide
            greghansen Greg Hansen added a comment -

            I'm on a VM, I'm hoping that's not the issue. The VM is configured with 4 virtual cpus (each Intel E5-2650 at 2.0 GHz), 8 GB RAM, and 10K RPM SAS drives. We just bought the servers a month or two ago, and from examining the performance logs of the VMware vSphere Center, I'm barely using 8% of the cpu available, max. The SVN server is hardware that's a couple of years old, but I'm getting those on newer hardware too (the 1.8 installation I mentioned).

            We're currently running SVN 1.6 in our repos, so the 1.7 issue isn't it. Good thought, though!

            I haven't looked at the Jenkins GC options. I'll research that. It would make sense if it jumped in and hogged the server for long periods of time, which is likely given that I'm running 27 projects/day.

            I did bump the timeout to 10 minutes on both sides (both the SVN machine and the Jenkins slave that's doing the checkout); all that did is make it wait longer to time out. If it helps any, here's my latest call stack:

            ERROR: Failed to check out https://gigasrc.gigamon.com/repos/gv_g/mainline/gv216
            org.tmatesoft.svn.core.SVNException: svn: E175002: REPORT /repos/!svn/vcc/default failed
            at org.tmatesoft.svn.core.internal.io.dav.http.HTTPConnection.request(HTTPConnection.java:379)
            at org.tmatesoft.svn.core.internal.io.dav.http.HTTPConnection.request(HTTPConnection.java:364)
            at org.tmatesoft.svn.core.internal.io.dav.http.HTTPConnection.request(HTTPConnection.java:352)
            at org.tmatesoft.svn.core.internal.io.dav.DAVConnection.performHttpRequest(DAVConnection.java:708)
            at org.tmatesoft.svn.core.internal.io.dav.DAVConnection.doReport(DAVConnection.java:335)
            at org.tmatesoft.svn.core.internal.io.dav.DAVRepository.runReport(DAVRepository.java:1289)
            at org.tmatesoft.svn.core.internal.io.dav.DAVRepository.update(DAVRepository.java:837)
            at org.tmatesoft.svn.core.internal.wc2.ng.SvnNgAbstractUpdate.updateInternal(SvnNgAbstractUpdate.java:192)
            at org.tmatesoft.svn.core.internal.wc2.ng.SvnNgAbstractUpdate.update(SvnNgAbstractUpdate.java:76)
            at org.tmatesoft.svn.core.internal.wc2.ng.SvnNgAbstractUpdate.checkout(SvnNgAbstractUpdate.java:752)
            at org.tmatesoft.svn.core.internal.wc2.ng.SvnNgCheckout.run(SvnNgCheckout.java:14)
            at org.tmatesoft.svn.core.internal.wc2.ng.SvnNgCheckout.run(SvnNgCheckout.java:9)
            at org.tmatesoft.svn.core.internal.wc2.ng.SvnNgOperationRunner.run(SvnNgOperationRunner.java:20)
            at org.tmatesoft.svn.core.internal.wc2.SvnOperationRunner.run(SvnOperationRunner.java:20)
            at org.tmatesoft.svn.core.wc2.SvnOperationFactory.run(SvnOperationFactory.java:1235)
            at org.tmatesoft.svn.core.wc2.SvnOperation.run(SvnOperation.java:291)
            at org.tmatesoft.svn.core.wc.SVNUpdateClient.doCheckout(SVNUpdateClient.java:777)
            at hudson.scm.subversion.CheckoutUpdater$1.perform(CheckoutUpdater.java:99)
            at hudson.scm.subversion.WorkspaceUpdater$UpdateTask.delegateTo(WorkspaceUpdater.java:153)
            at hudson.scm.SubversionSCM$CheckOutTask.perform(SubversionSCM.java:903)
            at hudson.scm.SubversionSCM$CheckOutTask.invoke(SubversionSCM.java:884)
            at hudson.scm.SubversionSCM$CheckOutTask.invoke(SubversionSCM.java:867)
            at hudson.FilePath$FileCallableWrapper.call(FilePath.java:2388)
            at hudson.remoting.UserRequest.perform(UserRequest.java:118)
            at hudson.remoting.UserRequest.perform(UserRequest.java:48)
            at hudson.remoting.Request$2.run(Request.java:326)
            at hudson.remoting.InterceptingExecutorService$1.call(InterceptingExecutorService.java:72)
            at java.util.concurrent.FutureTask$Sync.innerRun(Unknown Source)
            at java.util.concurrent.FutureTask.run(Unknown Source)
            at java.util.concurrent.ThreadPoolExecutor$Worker.runTask(Unknown Source)
            at java.util.concurrent.ThreadPoolExecutor$Worker.run(Unknown Source)
            at java.lang.Thread.run(Unknown Source)
            Caused by: svn: E175002: REPORT /repos/!svn/vcc/default failed
            at org.tmatesoft.svn.core.SVNErrorMessage.create(SVNErrorMessage.java:208)
            at org.tmatesoft.svn.core.SVNErrorMessage.create(SVNErrorMessage.java:154)
            at org.tmatesoft.svn.core.SVNErrorMessage.create(SVNErrorMessage.java:97)
            ... 32 more
            Caused by: org.tmatesoft.svn.core.SVNException: svn: E175002: REPORT request failed on '/repos/!svn/vcc/default'
            svn: E175002: timed out waiting for server
            at org.tmatesoft.svn.core.internal.wc.SVNErrorManager.error(SVNErrorManager.java:64)
            at org.tmatesoft.svn.core.internal.wc.SVNErrorManager.error(SVNErrorManager.java:51)
            at org.tmatesoft.svn.core.internal.io.dav.http.HTTPConnection._request(HTTPConnection.java:754)
            at org.tmatesoft.svn.core.internal.io.dav.http.HTTPConnection.request(HTTPConnection.java:373)
            ... 31 more
            Caused by: svn: E175002: REPORT request failed on '/repos/!svn/vcc/default'
            at org.tmatesoft.svn.core.SVNErrorMessage.create(SVNErrorMessage.java:208)
            at org.tmatesoft.svn.core.internal.io.dav.http.HTTPConnection._request(HTTPConnection.java:752)
            ... 32 more
            Caused by: svn: E175002: timed out waiting for server
            at org.tmatesoft.svn.core.SVNErrorMessage.create(SVNErrorMessage.java:208)
            at org.tmatesoft.svn.core.internal.io.dav.http.HTTPConnection._request(HTTPConnection.java:493)
            ... 32 more
            Caused by: java.net.SocketTimeoutException: Read timed out
            at java.net.SocketInputStream.socketRead0(Native Method)
            at java.net.SocketInputStream.read(Unknown Source)
            at com.sun.net.ssl.internal.ssl.InputRecord.readFully(Unknown Source)
            at com.sun.net.ssl.internal.ssl.InputRecord.readV3Record(Unknown Source)
            at com.sun.net.ssl.internal.ssl.InputRecord.read(Unknown Source)
            at com.sun.net.ssl.internal.ssl.SSLSocketImpl.readRecord(Unknown Source)
            at com.sun.net.ssl.internal.ssl.SSLSocketImpl.readDataRecord(Unknown Source)
            at com.sun.net.ssl.internal.ssl.AppInputStream.read(Unknown Source)
            at java.io.BufferedInputStream.read1(Unknown Source)
            at java.io.BufferedInputStream.read(Unknown Source)
            at org.tmatesoft.svn.core.internal.util.ChunkedInputStream.read(ChunkedInputStream.java:75)
            at sun.nio.cs.StreamDecoder.readBytes(Unknown Source)
            at sun.nio.cs.StreamDecoder.implRead(Unknown Source)
            at sun.nio.cs.StreamDecoder.read(Unknown Source)
            at java.io.InputStreamReader.read(Unknown Source)
            at org.tmatesoft.svn.core.internal.io.dav.http.XMLReader.read(XMLReader.java:39)
            at com.sun.org.apache.xerces.internal.impl.XMLEntityScanner.load(Unknown Source)
            at com.sun.org.apache.xerces.internal.impl.XMLEntityScanner.skipChar(Unknown Source)
            at com.sun.org.apache.xerces.internal.impl.XMLDocumentFragmentScannerImpl$FragmentContentDriver.next(Unknown Source)
            at com.sun.org.apache.xerces.internal.impl.XMLDocumentScannerImpl.next(Unknown Source)
            at com.sun.org.apache.xerces.internal.impl.XMLNSDocumentScannerImpl.next(Unknown Source)
            at com.sun.org.apache.xerces.internal.impl.XMLDocumentFragmentScannerImpl.scanDocument(Unknown Source)
            at com.sun.org.apache.xerces.internal.parsers.XML11Configuration.parse(Unknown Source)
            at com.sun.org.apache.xerces.internal.parsers.XML11Configuration.parse(Unknown Source)
            at com.sun.org.apache.xerces.internal.parsers.XMLParser.parse(Unknown Source)
            at com.sun.org.apache.xerces.internal.parsers.AbstractSAXParser.parse(Unknown Source)
            at com.sun.org.apache.xerces.internal.jaxp.SAXParserImpl$JAXPSAXParser.parse(Unknown Source)
            at org.tmatesoft.svn.core.internal.io.dav.http.HTTPConnection.readData(HTTPConnection.java:869)
            at org.tmatesoft.svn.core.internal.io.dav.http.HTTPConnection.readData(HTTPConnection.java:834)
            at org.tmatesoft.svn.core.internal.io.dav.http.HTTPRequest.dispatch(HTTPRequest.java:218)
            at org.tmatesoft.svn.core.internal.io.dav.http.HTTPConnection._request(HTTPConnection.java:460)
            ... 32 more
            hudson.util.IOException2: remote file operation failed: /var/jenkins/workspace/GV216_main at hudson.remoting.Channel@7fa17f0:jenkins-slave002
            at hudson.FilePath.act(FilePath.java:901)
            at hudson.FilePath.act(FilePath.java:878)
            at hudson.scm.SubversionSCM.checkout(SubversionSCM.java:843)
            at hudson.scm.SubversionSCM.checkout(SubversionSCM.java:781)
            at hudson.model.AbstractProject.checkout(AbstractProject.java:1369)
            at hudson.model.AbstractBuild$AbstractBuildExecution.defaultCheckout(AbstractBuild.java:676)
            at jenkins.scm.SCMCheckoutStrategy.checkout(SCMCheckoutStrategy.java:88)
            at hudson.model.AbstractBuild$AbstractBuildExecution.run(AbstractBuild.java:581)
            at hudson.model.Run.execute(Run.java:1593)
            at hudson.model.FreeStyleBuild.run(FreeStyleBuild.java:46)
            at hudson.model.ResourceController.execute(ResourceController.java:88)
            at hudson.model.Executor.run(Executor.java:242)
            Caused by: java.io.IOException: Failed to check out https://gigasrc.gigamon.com/repos/gv_g/mainline/gv216
            at hudson.scm.subversion.CheckoutUpdater$1.perform(CheckoutUpdater.java:110)
            at hudson.scm.subversion.WorkspaceUpdater$UpdateTask.delegateTo(WorkspaceUpdater.java:153)
            at hudson.scm.SubversionSCM$CheckOutTask.perform(SubversionSCM.java:903)
            at hudson.scm.SubversionSCM$CheckOutTask.invoke(SubversionSCM.java:884)
            at hudson.scm.SubversionSCM$CheckOutTask.invoke(SubversionSCM.java:867)
            at hudson.FilePath$FileCallableWrapper.call(FilePath.java:2388)
            at hudson.remoting.UserRequest.perform(UserRequest.java:118)
            at hudson.remoting.UserRequest.perform(UserRequest.java:48)
            at hudson.remoting.Request$2.run(Request.java:326)
            at hudson.remoting.InterceptingExecutorService$1.call(InterceptingExecutorService.java:72)
            at java.util.concurrent.FutureTask$Sync.innerRun(Unknown Source)
            at java.util.concurrent.FutureTask.run(Unknown Source)
            at java.util.concurrent.ThreadPoolExecutor$Worker.runTask(Unknown Source)
            at java.util.concurrent.ThreadPoolExecutor$Worker.run(Unknown Source)
            at java.lang.Thread.run(Unknown Source)
            Caused by: org.tmatesoft.svn.core.SVNException: svn: E175002: REPORT /repos/!svn/vcc/default failed
            at org.tmatesoft.svn.core.internal.io.dav.http.HTTPConnection.request(HTTPConnection.java:379)
            at org.tmatesoft.svn.core.internal.io.dav.http.HTTPConnection.request(HTTPConnection.java:364)
            at org.tmatesoft.svn.core.internal.io.dav.http.HTTPConnection.request(HTTPConnection.java:352)
            at org.tmatesoft.svn.core.internal.io.dav.DAVConnection.performHttpRequest(DAVConnection.java:708)
            at org.tmatesoft.svn.core.internal.io.dav.DAVConnection.doReport(DAVConnection.java:335)
            at org.tmatesoft.svn.core.internal.io.dav.DAVRepository.runReport(DAVRepository.java:1289)
            at org.tmatesoft.svn.core.internal.io.dav.DAVRepository.update(DAVRepository.java:837)
            at org.tmatesoft.svn.core.internal.wc2.ng.SvnNgAbstractUpdate.updateInternal(SvnNgAbstractUpdate.java:192)
            at org.tmatesoft.svn.core.internal.wc2.ng.SvnNgAbstractUpdate.update(SvnNgAbstractUpdate.java:76)
            at org.tmatesoft.svn.core.internal.wc2.ng.SvnNgAbstractUpdate.checkout(SvnNgAbstractUpdate.java:752)
            at org.tmatesoft.svn.core.internal.wc2.ng.SvnNgCheckout.run(SvnNgCheckout.java:14)
            at org.tmatesoft.svn.core.internal.wc2.ng.SvnNgCheckout.run(SvnNgCheckout.java:9)
            at org.tmatesoft.svn.core.internal.wc2.ng.SvnNgOperationRunner.run(SvnNgOperationRunner.java:20)
            at org.tmatesoft.svn.core.internal.wc2.SvnOperationRunner.run(SvnOperationRunner.java:20)
            at org.tmatesoft.svn.core.wc2.SvnOperationFactory.run(SvnOperationFactory.java:1235)
            at org.tmatesoft.svn.core.wc2.SvnOperation.run(SvnOperation.java:291)
            at org.tmatesoft.svn.core.wc.SVNUpdateClient.doCheckout(SVNUpdateClient.java:777)
            at hudson.scm.subversion.CheckoutUpdater$1.perform(CheckoutUpdater.java:99)
            ... 14 more
            Caused by: svn: E175002: REPORT /repos/!svn/vcc/default failed
            at org.tmatesoft.svn.core.SVNErrorMessage.create(SVNErrorMessage.java:208)
            at org.tmatesoft.svn.core.SVNErrorMessage.create(SVNErrorMessage.java:154)
            at org.tmatesoft.svn.core.SVNErrorMessage.create(SVNErrorMessage.java:97)
            ... 32 more
            Caused by: org.tmatesoft.svn.core.SVNException: svn: E175002: REPORT request failed on '/repos/!svn/vcc/default'
            svn: E175002: timed out waiting for server
            at org.tmatesoft.svn.core.internal.wc.SVNErrorManager.error(SVNErrorManager.java:64)
            at org.tmatesoft.svn.core.internal.wc.SVNErrorManager.error(SVNErrorManager.java:51)
            at org.tmatesoft.svn.core.internal.io.dav.http.HTTPConnection._request(HTTPConnection.java:754)
            at org.tmatesoft.svn.core.internal.io.dav.http.HTTPConnection.request(HTTPConnection.java:373)
            ... 31 more
            Caused by: svn: E175002: REPORT request failed on '/repos/!svn/vcc/default'
            at org.tmatesoft.svn.core.SVNErrorMessage.create(SVNErrorMessage.java:208)
            at org.tmatesoft.svn.core.internal.io.dav.http.HTTPConnection._request(HTTPConnection.java:752)
            ... 32 more
            Caused by: svn: E175002: timed out waiting for server
            at org.tmatesoft.svn.core.SVNErrorMessage.create(SVNErrorMessage.java:208)
            at org.tmatesoft.svn.core.internal.io.dav.http.HTTPConnection._request(HTTPConnection.java:493)
            ... 32 more
            Caused by: java.net.SocketTimeoutException: Read timed out
            at java.net.SocketInputStream.socketRead0(Native Method)
            at java.net.SocketInputStream.read(Unknown Source)
            at com.sun.net.ssl.internal.ssl.InputRecord.readFully(Unknown Source)
            at com.sun.net.ssl.internal.ssl.InputRecord.readV3Record(Unknown Source)
            at com.sun.net.ssl.internal.ssl.InputRecord.read(Unknown Source)
            at com.sun.net.ssl.internal.ssl.SSLSocketImpl.readRecord(Unknown Source)
            at com.sun.net.ssl.internal.ssl.SSLSocketImpl.readDataRecord(Unknown Source)
            at com.sun.net.ssl.internal.ssl.AppInputStream.read(Unknown Source)
            at java.io.BufferedInputStream.read1(Unknown Source)
            at java.io.BufferedInputStream.read(Unknown Source)
            at org.tmatesoft.svn.core.internal.util.ChunkedInputStream.read(ChunkedInputStream.java:75)
            at sun.nio.cs.StreamDecoder.readBytes(Unknown Source)
            at sun.nio.cs.StreamDecoder.implRead(Unknown Source)
            at sun.nio.cs.StreamDecoder.read(Unknown Source)
            at java.io.InputStreamReader.read(Unknown Source)
            at org.tmatesoft.svn.core.internal.io.dav.http.XMLReader.read(XMLReader.java:39)
            at com.sun.org.apache.xerces.internal.impl.XMLEntityScanner.load(Unknown Source)
            at com.sun.org.apache.xerces.internal.impl.XMLEntityScanner.skipChar(Unknown Source)
            at com.sun.org.apache.xerces.internal.impl.XMLDocumentFragmentScannerImpl$FragmentContentDriver.next(Unknown Source)
            at com.sun.org.apache.xerces.internal.impl.XMLDocumentScannerImpl.next(Unknown Source)
            at com.sun.org.apache.xerces.internal.impl.XMLNSDocumentScannerImpl.next(Unknown Source)
            at com.sun.org.apache.xerces.internal.impl.XMLDocumentFragmentScannerImpl.scanDocument(Unknown Source)
            at com.sun.org.apache.xerces.internal.parsers.XML11Configuration.parse(Unknown Source)
            at com.sun.org.apache.xerces.internal.parsers.XML11Configuration.parse(Unknown Source)
            at com.sun.org.apache.xerces.internal.parsers.XMLParser.parse(Unknown Source)
            at com.sun.org.apache.xerces.internal.parsers.AbstractSAXParser.parse(Unknown Source)
            at com.sun.org.apache.xerces.internal.jaxp.SAXParserImpl$JAXPSAXParser.parse(Unknown Source)
            at org.tmatesoft.svn.core.internal.io.dav.http.HTTPConnection.readData(HTTPConnection.java:869)
            at org.tmatesoft.svn.core.internal.io.dav.http.HTTPConnection.readData(HTTPConnection.java:834)
            at org.tmatesoft.svn.core.internal.io.dav.http.HTTPRequest.dispatch(HTTPRequest.java:218)
            at org.tmatesoft.svn.core.internal.io.dav.http.HTTPConnection._request(HTTPConnection.java:460)
            ... 32 more
            Archiving artifacts

            Show
            greghansen Greg Hansen added a comment - I'm on a VM, I'm hoping that's not the issue. The VM is configured with 4 virtual cpus (each Intel E5-2650 at 2.0 GHz), 8 GB RAM, and 10K RPM SAS drives. We just bought the servers a month or two ago, and from examining the performance logs of the VMware vSphere Center, I'm barely using 8% of the cpu available, max. The SVN server is hardware that's a couple of years old, but I'm getting those on newer hardware too (the 1.8 installation I mentioned). We're currently running SVN 1.6 in our repos, so the 1.7 issue isn't it. Good thought, though! I haven't looked at the Jenkins GC options. I'll research that. It would make sense if it jumped in and hogged the server for long periods of time, which is likely given that I'm running 27 projects/day. I did bump the timeout to 10 minutes on both sides (both the SVN machine and the Jenkins slave that's doing the checkout); all that did is make it wait longer to time out. If it helps any, here's my latest call stack: ERROR: Failed to check out https://gigasrc.gigamon.com/repos/gv_g/mainline/gv216 org.tmatesoft.svn.core.SVNException: svn: E175002: REPORT /repos/!svn/vcc/default failed at org.tmatesoft.svn.core.internal.io.dav.http.HTTPConnection.request(HTTPConnection.java:379) at org.tmatesoft.svn.core.internal.io.dav.http.HTTPConnection.request(HTTPConnection.java:364) at org.tmatesoft.svn.core.internal.io.dav.http.HTTPConnection.request(HTTPConnection.java:352) at org.tmatesoft.svn.core.internal.io.dav.DAVConnection.performHttpRequest(DAVConnection.java:708) at org.tmatesoft.svn.core.internal.io.dav.DAVConnection.doReport(DAVConnection.java:335) at org.tmatesoft.svn.core.internal.io.dav.DAVRepository.runReport(DAVRepository.java:1289) at org.tmatesoft.svn.core.internal.io.dav.DAVRepository.update(DAVRepository.java:837) at org.tmatesoft.svn.core.internal.wc2.ng.SvnNgAbstractUpdate.updateInternal(SvnNgAbstractUpdate.java:192) at org.tmatesoft.svn.core.internal.wc2.ng.SvnNgAbstractUpdate.update(SvnNgAbstractUpdate.java:76) at org.tmatesoft.svn.core.internal.wc2.ng.SvnNgAbstractUpdate.checkout(SvnNgAbstractUpdate.java:752) at org.tmatesoft.svn.core.internal.wc2.ng.SvnNgCheckout.run(SvnNgCheckout.java:14) at org.tmatesoft.svn.core.internal.wc2.ng.SvnNgCheckout.run(SvnNgCheckout.java:9) at org.tmatesoft.svn.core.internal.wc2.ng.SvnNgOperationRunner.run(SvnNgOperationRunner.java:20) at org.tmatesoft.svn.core.internal.wc2.SvnOperationRunner.run(SvnOperationRunner.java:20) at org.tmatesoft.svn.core.wc2.SvnOperationFactory.run(SvnOperationFactory.java:1235) at org.tmatesoft.svn.core.wc2.SvnOperation.run(SvnOperation.java:291) at org.tmatesoft.svn.core.wc.SVNUpdateClient.doCheckout(SVNUpdateClient.java:777) at hudson.scm.subversion.CheckoutUpdater$1.perform(CheckoutUpdater.java:99) at hudson.scm.subversion.WorkspaceUpdater$UpdateTask.delegateTo(WorkspaceUpdater.java:153) at hudson.scm.SubversionSCM$CheckOutTask.perform(SubversionSCM.java:903) at hudson.scm.SubversionSCM$CheckOutTask.invoke(SubversionSCM.java:884) at hudson.scm.SubversionSCM$CheckOutTask.invoke(SubversionSCM.java:867) at hudson.FilePath$FileCallableWrapper.call(FilePath.java:2388) at hudson.remoting.UserRequest.perform(UserRequest.java:118) at hudson.remoting.UserRequest.perform(UserRequest.java:48) at hudson.remoting.Request$2.run(Request.java:326) at hudson.remoting.InterceptingExecutorService$1.call(InterceptingExecutorService.java:72) at java.util.concurrent.FutureTask$Sync.innerRun(Unknown Source) at java.util.concurrent.FutureTask.run(Unknown Source) at java.util.concurrent.ThreadPoolExecutor$Worker.runTask(Unknown Source) at java.util.concurrent.ThreadPoolExecutor$Worker.run(Unknown Source) at java.lang.Thread.run(Unknown Source) Caused by: svn: E175002: REPORT /repos/!svn/vcc/default failed at org.tmatesoft.svn.core.SVNErrorMessage.create(SVNErrorMessage.java:208) at org.tmatesoft.svn.core.SVNErrorMessage.create(SVNErrorMessage.java:154) at org.tmatesoft.svn.core.SVNErrorMessage.create(SVNErrorMessage.java:97) ... 32 more Caused by: org.tmatesoft.svn.core.SVNException: svn: E175002: REPORT request failed on '/repos/!svn/vcc/default' svn: E175002: timed out waiting for server at org.tmatesoft.svn.core.internal.wc.SVNErrorManager.error(SVNErrorManager.java:64) at org.tmatesoft.svn.core.internal.wc.SVNErrorManager.error(SVNErrorManager.java:51) at org.tmatesoft.svn.core.internal.io.dav.http.HTTPConnection._request(HTTPConnection.java:754) at org.tmatesoft.svn.core.internal.io.dav.http.HTTPConnection.request(HTTPConnection.java:373) ... 31 more Caused by: svn: E175002: REPORT request failed on '/repos/!svn/vcc/default' at org.tmatesoft.svn.core.SVNErrorMessage.create(SVNErrorMessage.java:208) at org.tmatesoft.svn.core.internal.io.dav.http.HTTPConnection._request(HTTPConnection.java:752) ... 32 more Caused by: svn: E175002: timed out waiting for server at org.tmatesoft.svn.core.SVNErrorMessage.create(SVNErrorMessage.java:208) at org.tmatesoft.svn.core.internal.io.dav.http.HTTPConnection._request(HTTPConnection.java:493) ... 32 more Caused by: java.net.SocketTimeoutException: Read timed out at java.net.SocketInputStream.socketRead0(Native Method) at java.net.SocketInputStream.read(Unknown Source) at com.sun.net.ssl.internal.ssl.InputRecord.readFully(Unknown Source) at com.sun.net.ssl.internal.ssl.InputRecord.readV3Record(Unknown Source) at com.sun.net.ssl.internal.ssl.InputRecord.read(Unknown Source) at com.sun.net.ssl.internal.ssl.SSLSocketImpl.readRecord(Unknown Source) at com.sun.net.ssl.internal.ssl.SSLSocketImpl.readDataRecord(Unknown Source) at com.sun.net.ssl.internal.ssl.AppInputStream.read(Unknown Source) at java.io.BufferedInputStream.read1(Unknown Source) at java.io.BufferedInputStream.read(Unknown Source) at org.tmatesoft.svn.core.internal.util.ChunkedInputStream.read(ChunkedInputStream.java:75) at sun.nio.cs.StreamDecoder.readBytes(Unknown Source) at sun.nio.cs.StreamDecoder.implRead(Unknown Source) at sun.nio.cs.StreamDecoder.read(Unknown Source) at java.io.InputStreamReader.read(Unknown Source) at org.tmatesoft.svn.core.internal.io.dav.http.XMLReader.read(XMLReader.java:39) at com.sun.org.apache.xerces.internal.impl.XMLEntityScanner.load(Unknown Source) at com.sun.org.apache.xerces.internal.impl.XMLEntityScanner.skipChar(Unknown Source) at com.sun.org.apache.xerces.internal.impl.XMLDocumentFragmentScannerImpl$FragmentContentDriver.next(Unknown Source) at com.sun.org.apache.xerces.internal.impl.XMLDocumentScannerImpl.next(Unknown Source) at com.sun.org.apache.xerces.internal.impl.XMLNSDocumentScannerImpl.next(Unknown Source) at com.sun.org.apache.xerces.internal.impl.XMLDocumentFragmentScannerImpl.scanDocument(Unknown Source) at com.sun.org.apache.xerces.internal.parsers.XML11Configuration.parse(Unknown Source) at com.sun.org.apache.xerces.internal.parsers.XML11Configuration.parse(Unknown Source) at com.sun.org.apache.xerces.internal.parsers.XMLParser.parse(Unknown Source) at com.sun.org.apache.xerces.internal.parsers.AbstractSAXParser.parse(Unknown Source) at com.sun.org.apache.xerces.internal.jaxp.SAXParserImpl$JAXPSAXParser.parse(Unknown Source) at org.tmatesoft.svn.core.internal.io.dav.http.HTTPConnection.readData(HTTPConnection.java:869) at org.tmatesoft.svn.core.internal.io.dav.http.HTTPConnection.readData(HTTPConnection.java:834) at org.tmatesoft.svn.core.internal.io.dav.http.HTTPRequest.dispatch(HTTPRequest.java:218) at org.tmatesoft.svn.core.internal.io.dav.http.HTTPConnection._request(HTTPConnection.java:460) ... 32 more hudson.util.IOException2: remote file operation failed: /var/jenkins/workspace/GV216_main at hudson.remoting.Channel@7fa17f0:jenkins-slave002 at hudson.FilePath.act(FilePath.java:901) at hudson.FilePath.act(FilePath.java:878) at hudson.scm.SubversionSCM.checkout(SubversionSCM.java:843) at hudson.scm.SubversionSCM.checkout(SubversionSCM.java:781) at hudson.model.AbstractProject.checkout(AbstractProject.java:1369) at hudson.model.AbstractBuild$AbstractBuildExecution.defaultCheckout(AbstractBuild.java:676) at jenkins.scm.SCMCheckoutStrategy.checkout(SCMCheckoutStrategy.java:88) at hudson.model.AbstractBuild$AbstractBuildExecution.run(AbstractBuild.java:581) at hudson.model.Run.execute(Run.java:1593) at hudson.model.FreeStyleBuild.run(FreeStyleBuild.java:46) at hudson.model.ResourceController.execute(ResourceController.java:88) at hudson.model.Executor.run(Executor.java:242) Caused by: java.io.IOException: Failed to check out https://gigasrc.gigamon.com/repos/gv_g/mainline/gv216 at hudson.scm.subversion.CheckoutUpdater$1.perform(CheckoutUpdater.java:110) at hudson.scm.subversion.WorkspaceUpdater$UpdateTask.delegateTo(WorkspaceUpdater.java:153) at hudson.scm.SubversionSCM$CheckOutTask.perform(SubversionSCM.java:903) at hudson.scm.SubversionSCM$CheckOutTask.invoke(SubversionSCM.java:884) at hudson.scm.SubversionSCM$CheckOutTask.invoke(SubversionSCM.java:867) at hudson.FilePath$FileCallableWrapper.call(FilePath.java:2388) at hudson.remoting.UserRequest.perform(UserRequest.java:118) at hudson.remoting.UserRequest.perform(UserRequest.java:48) at hudson.remoting.Request$2.run(Request.java:326) at hudson.remoting.InterceptingExecutorService$1.call(InterceptingExecutorService.java:72) at java.util.concurrent.FutureTask$Sync.innerRun(Unknown Source) at java.util.concurrent.FutureTask.run(Unknown Source) at java.util.concurrent.ThreadPoolExecutor$Worker.runTask(Unknown Source) at java.util.concurrent.ThreadPoolExecutor$Worker.run(Unknown Source) at java.lang.Thread.run(Unknown Source) Caused by: org.tmatesoft.svn.core.SVNException: svn: E175002: REPORT /repos/!svn/vcc/default failed at org.tmatesoft.svn.core.internal.io.dav.http.HTTPConnection.request(HTTPConnection.java:379) at org.tmatesoft.svn.core.internal.io.dav.http.HTTPConnection.request(HTTPConnection.java:364) at org.tmatesoft.svn.core.internal.io.dav.http.HTTPConnection.request(HTTPConnection.java:352) at org.tmatesoft.svn.core.internal.io.dav.DAVConnection.performHttpRequest(DAVConnection.java:708) at org.tmatesoft.svn.core.internal.io.dav.DAVConnection.doReport(DAVConnection.java:335) at org.tmatesoft.svn.core.internal.io.dav.DAVRepository.runReport(DAVRepository.java:1289) at org.tmatesoft.svn.core.internal.io.dav.DAVRepository.update(DAVRepository.java:837) at org.tmatesoft.svn.core.internal.wc2.ng.SvnNgAbstractUpdate.updateInternal(SvnNgAbstractUpdate.java:192) at org.tmatesoft.svn.core.internal.wc2.ng.SvnNgAbstractUpdate.update(SvnNgAbstractUpdate.java:76) at org.tmatesoft.svn.core.internal.wc2.ng.SvnNgAbstractUpdate.checkout(SvnNgAbstractUpdate.java:752) at org.tmatesoft.svn.core.internal.wc2.ng.SvnNgCheckout.run(SvnNgCheckout.java:14) at org.tmatesoft.svn.core.internal.wc2.ng.SvnNgCheckout.run(SvnNgCheckout.java:9) at org.tmatesoft.svn.core.internal.wc2.ng.SvnNgOperationRunner.run(SvnNgOperationRunner.java:20) at org.tmatesoft.svn.core.internal.wc2.SvnOperationRunner.run(SvnOperationRunner.java:20) at org.tmatesoft.svn.core.wc2.SvnOperationFactory.run(SvnOperationFactory.java:1235) at org.tmatesoft.svn.core.wc2.SvnOperation.run(SvnOperation.java:291) at org.tmatesoft.svn.core.wc.SVNUpdateClient.doCheckout(SVNUpdateClient.java:777) at hudson.scm.subversion.CheckoutUpdater$1.perform(CheckoutUpdater.java:99) ... 14 more Caused by: svn: E175002: REPORT /repos/!svn/vcc/default failed at org.tmatesoft.svn.core.SVNErrorMessage.create(SVNErrorMessage.java:208) at org.tmatesoft.svn.core.SVNErrorMessage.create(SVNErrorMessage.java:154) at org.tmatesoft.svn.core.SVNErrorMessage.create(SVNErrorMessage.java:97) ... 32 more Caused by: org.tmatesoft.svn.core.SVNException: svn: E175002: REPORT request failed on '/repos/!svn/vcc/default' svn: E175002: timed out waiting for server at org.tmatesoft.svn.core.internal.wc.SVNErrorManager.error(SVNErrorManager.java:64) at org.tmatesoft.svn.core.internal.wc.SVNErrorManager.error(SVNErrorManager.java:51) at org.tmatesoft.svn.core.internal.io.dav.http.HTTPConnection._request(HTTPConnection.java:754) at org.tmatesoft.svn.core.internal.io.dav.http.HTTPConnection.request(HTTPConnection.java:373) ... 31 more Caused by: svn: E175002: REPORT request failed on '/repos/!svn/vcc/default' at org.tmatesoft.svn.core.SVNErrorMessage.create(SVNErrorMessage.java:208) at org.tmatesoft.svn.core.internal.io.dav.http.HTTPConnection._request(HTTPConnection.java:752) ... 32 more Caused by: svn: E175002: timed out waiting for server at org.tmatesoft.svn.core.SVNErrorMessage.create(SVNErrorMessage.java:208) at org.tmatesoft.svn.core.internal.io.dav.http.HTTPConnection._request(HTTPConnection.java:493) ... 32 more Caused by: java.net.SocketTimeoutException: Read timed out at java.net.SocketInputStream.socketRead0(Native Method) at java.net.SocketInputStream.read(Unknown Source) at com.sun.net.ssl.internal.ssl.InputRecord.readFully(Unknown Source) at com.sun.net.ssl.internal.ssl.InputRecord.readV3Record(Unknown Source) at com.sun.net.ssl.internal.ssl.InputRecord.read(Unknown Source) at com.sun.net.ssl.internal.ssl.SSLSocketImpl.readRecord(Unknown Source) at com.sun.net.ssl.internal.ssl.SSLSocketImpl.readDataRecord(Unknown Source) at com.sun.net.ssl.internal.ssl.AppInputStream.read(Unknown Source) at java.io.BufferedInputStream.read1(Unknown Source) at java.io.BufferedInputStream.read(Unknown Source) at org.tmatesoft.svn.core.internal.util.ChunkedInputStream.read(ChunkedInputStream.java:75) at sun.nio.cs.StreamDecoder.readBytes(Unknown Source) at sun.nio.cs.StreamDecoder.implRead(Unknown Source) at sun.nio.cs.StreamDecoder.read(Unknown Source) at java.io.InputStreamReader.read(Unknown Source) at org.tmatesoft.svn.core.internal.io.dav.http.XMLReader.read(XMLReader.java:39) at com.sun.org.apache.xerces.internal.impl.XMLEntityScanner.load(Unknown Source) at com.sun.org.apache.xerces.internal.impl.XMLEntityScanner.skipChar(Unknown Source) at com.sun.org.apache.xerces.internal.impl.XMLDocumentFragmentScannerImpl$FragmentContentDriver.next(Unknown Source) at com.sun.org.apache.xerces.internal.impl.XMLDocumentScannerImpl.next(Unknown Source) at com.sun.org.apache.xerces.internal.impl.XMLNSDocumentScannerImpl.next(Unknown Source) at com.sun.org.apache.xerces.internal.impl.XMLDocumentFragmentScannerImpl.scanDocument(Unknown Source) at com.sun.org.apache.xerces.internal.parsers.XML11Configuration.parse(Unknown Source) at com.sun.org.apache.xerces.internal.parsers.XML11Configuration.parse(Unknown Source) at com.sun.org.apache.xerces.internal.parsers.XMLParser.parse(Unknown Source) at com.sun.org.apache.xerces.internal.parsers.AbstractSAXParser.parse(Unknown Source) at com.sun.org.apache.xerces.internal.jaxp.SAXParserImpl$JAXPSAXParser.parse(Unknown Source) at org.tmatesoft.svn.core.internal.io.dav.http.HTTPConnection.readData(HTTPConnection.java:869) at org.tmatesoft.svn.core.internal.io.dav.http.HTTPConnection.readData(HTTPConnection.java:834) at org.tmatesoft.svn.core.internal.io.dav.http.HTTPRequest.dispatch(HTTPRequest.java:218) at org.tmatesoft.svn.core.internal.io.dav.http.HTTPConnection._request(HTTPConnection.java:460) ... 32 more Archiving artifacts
            Hide
            greghansen Greg Hansen added a comment - - edited

            Just to close the loop, what I have found is that this issue is related to garbage collection in the underlying JVM. I installed the monitoring plugin that uses JavaMelody (see https://wiki.jenkins-ci.org/display/JENKINS/Monitoring), and if I trigger two successive garbage collections before the bulk of the builds run, then I don't get this error any more. (The clue came from this post: http://jenkins-ci.361315.n4.nabble.com/Hudson-garbage-collection-on-schedule-td3050696.html). From looking at the graphs generated by the plugin, what seems to happen is that if there is too much VM available, then the amount of time that garbage collection takes when it finally is triggered exceeds the amount of time required to maintain the connection to SVN. I have not characterized the times involved, just noted empirically that starting my daily builds runs with the smallest amount of VM possible seems to help a lot.

            Maybe there's such a thing as having too much VM?

            Perhaps mention of this could be made in the "setting up Jenkins" articles?

            Show
            greghansen Greg Hansen added a comment - - edited Just to close the loop, what I have found is that this issue is related to garbage collection in the underlying JVM. I installed the monitoring plugin that uses JavaMelody (see https://wiki.jenkins-ci.org/display/JENKINS/Monitoring ), and if I trigger two successive garbage collections before the bulk of the builds run, then I don't get this error any more. (The clue came from this post: http://jenkins-ci.361315.n4.nabble.com/Hudson-garbage-collection-on-schedule-td3050696.html ). From looking at the graphs generated by the plugin, what seems to happen is that if there is too much VM available, then the amount of time that garbage collection takes when it finally is triggered exceeds the amount of time required to maintain the connection to SVN. I have not characterized the times involved, just noted empirically that starting my daily builds runs with the smallest amount of VM possible seems to help a lot. Maybe there's such a thing as having too much VM? Perhaps mention of this could be made in the "setting up Jenkins" articles?
            Hide
            centic centic added a comment -

            So either the Garbage Collector that you run is not ideal for your type of load or you have enough memory, but just barely enough and because of this the GC needs to do lots of work to make some memory available.

            In the first case a look at some garbage collection tuning will help, in the second a bit more memory might do the trick. Looking at the Java VM with jvisualvm can give you an idea how memory of the application looks like and which solution might give better results.

            Maybe you can provide some facts, e.g. actual memory settings and what the memory graphs look like.

            Show
            centic centic added a comment - So either the Garbage Collector that you run is not ideal for your type of load or you have enough memory, but just barely enough and because of this the GC needs to do lots of work to make some memory available. In the first case a look at some garbage collection tuning will help, in the second a bit more memory might do the trick. Looking at the Java VM with jvisualvm can give you an idea how memory of the application looks like and which solution might give better results. Maybe you can provide some facts, e.g. actual memory settings and what the memory graphs look like.
            Hide
            greghansen Greg Hansen added a comment -

            I have not had time to look into this more, but my colleague found an excellent solution. He installed both the monitoring and the groovy plugins, and found that there was now an option to "Execute System Groovy script" available for the build step. The script he ran is as follows:

            import net.bull.javamelody.*;

            before = Runtime.getRuntime().totalMemory() - Runtime.getRuntime().freeMemory();
            System.gc();
            after = Runtime.getRuntime().totalMemory() - Runtime.getRuntime().freeMemory();
            println I18N.getFormattedString("ramasse_miette_execute", Math.round((before - after) / 1024));

            He set this to run every 10 minutes, so that each garbage collection was small, and we are confident that this will eliminate the problem. Here's hoping that this will help others with similar problems!

            Show
            greghansen Greg Hansen added a comment - I have not had time to look into this more, but my colleague found an excellent solution. He installed both the monitoring and the groovy plugins, and found that there was now an option to "Execute System Groovy script" available for the build step. The script he ran is as follows: import net.bull.javamelody.*; before = Runtime.getRuntime().totalMemory() - Runtime.getRuntime().freeMemory(); System.gc(); after = Runtime.getRuntime().totalMemory() - Runtime.getRuntime().freeMemory(); println I18N.getFormattedString("ramasse_miette_execute", Math.round((before - after) / 1024)); He set this to run every 10 minutes, so that each garbage collection was small, and we are confident that this will eliminate the problem. Here's hoping that this will help others with similar problems!
            Hide
            recena Manuel Recena Soto added a comment -

            pancake, Did you solve your problem by upgrading to newest versions?

            Show
            recena Manuel Recena Soto added a comment - pancake , Did you solve your problem by upgrading to newest versions?
            Hide
            recena Manuel Recena Soto added a comment -

            In my opinion, we should close this ticket.

            Show
            recena Manuel Recena Soto added a comment - In my opinion, we should close this ticket.
            recena Manuel Recena Soto made changes -
            Assignee Manuel Jesús Recena Soto [ recena ]
            Hide
            recena Manuel Recena Soto added a comment -

            This ticket mentions a very old version of Subversion Plugin. There is no feedback for a long time.

            Show
            recena Manuel Recena Soto added a comment - This ticket mentions a very old version of Subversion Plugin. There is no feedback for a long time.
            recena Manuel Recena Soto made changes -
            Status Open [ 1 ] Closed [ 6 ]
            Resolution Won't Fix [ 2 ]
            rtyler R. Tyler Croy made changes -
            Workflow JNJira [ 144303 ] JNJira + In-Review [ 205867 ]

              People

              • Assignee:
                recena Manuel Recena Soto
                Reporter:
                pancake pancake
              • Votes:
                50 Vote for this issue
                Watchers:
                58 Start watching this issue

                Dates

                • Created:
                  Updated:
                  Resolved: