Details

    • Similar Issues:

      Description

      When I run NUnit tests using the NUnit 3 Beta 1 the tests execute but the build fails when the NUnit plugin tries to publish the results. Exception I get in Jenkins console is:

      Test Run Summary
      Overall result: Passed
      Tests run: 9, Passed: 9, Errors: 0, Failures: 0, Inconclusive: 0
      Not run: 0, Invalid: 0, Ignored: 0, Skipped: 0
      Start time: 2015-04-12 04:15:47Z
      End time: 2015-04-12 04:24:43Z
      Duration: 535.974 seconds

      Results (nunit3) saved as nunit-selenium-testsuite.xml

      Recording NUnit tests results
      ERROR: Publisher hudson.plugins.nunit.NUnitPublisher aborted due to exception hudson.util.IOException2: Could not transform the NUnit report. Please report this issue to the plugin author
      at hudson.plugins.nunit.NUnitArchiver.invoke(NUnitArchiver.java:60)
      at hudson.plugins.nunit.NUnitArchiver.invoke(NUnitArchiver.java:26)
      at hudson.FilePath.act(FilePath.java:989)
      at hudson.FilePath.act(FilePath.java:967)
      at hudson.plugins.nunit.NUnitPublisher.perform(NUnitPublisher.java:116)
      at hudson.tasks.BuildStepMonitor$3.perform(BuildStepMonitor.java:45)
      at hudson.model.AbstractBuild$AbstractBuildExecution.perform(AbstractBuild.java:761)
      at hudson.model.AbstractBuild$AbstractBuildExecution.performAllBuildSteps(AbstractBuild.java:721)
      at hudson.model.Build$BuildExecution.post2(Build.java:183)
      at hudson.model.AbstractBuild$AbstractBuildExecution.post(AbstractBuild.java:670)
      at hudson.model.Run.execute(Run.java:1766)
      at hudson.model.FreeStyleBuild.run(FreeStyleBuild.java:43)
      at hudson.model.ResourceController.execute(ResourceController.java:98)
      at hudson.model.Executor.run(Executor.java:374)
      Caused by: org.xml.sax.SAXParseException; systemId: file:/C:/Jenkins/workspace/Saucery3NUnit/temporary-junit-reports/temp-junit.xml; lineNumber: 12; columnNumber: 9; Content is not allowed in prolog.
      at com.sun.org.apache.xerces.internal.parsers.DOMParser.parse(DOMParser.java:257)
      at com.sun.org.apache.xerces.internal.jaxp.DocumentBuilderImpl.parse(DocumentBuilderImpl.java:348)
      at javax.xml.parsers.DocumentBuilder.parse(DocumentBuilder.java:205)
      at hudson.plugins.nunit.NUnitReportTransformer.splitJUnitFile(NUnitReportTransformer.java:102)
      at hudson.plugins.nunit.NUnitReportTransformer.transform(NUnitReportTransformer.java:72)
      at hudson.plugins.nunit.NUnitArchiver.invoke(NUnitArchiver.java:55)

        Attachments

        1. jenkins-nunit3-error.txt
          4 kB
        2. nunit.hpi
          19 kB
        3. nunit2_TestResult.xml
          2 kB
        4. nunit3_TestResult.xml
          3 kB
        5. nunit-selenium-testsuite.xml
          9 kB
        6. TestResult.xml
          2 kB

          Issue Links

            Activity

            apgray Andrew Gray created issue -
            Hide
            kinow Bruno P. Kinoshita added a comment -

            Can you attach the temp-junit.xml XML file as well, please? What it looks like, is that something changed in the way NUnit produces XML's, and the plug-in needs some adjustments in order to correctly parse it.

            Thanks.
            Bruno

            Show
            kinow Bruno P. Kinoshita added a comment - Can you attach the temp-junit.xml XML file as well, please? What it looks like, is that something changed in the way NUnit produces XML's, and the plug-in needs some adjustments in order to correctly parse it. Thanks. Bruno
            apgray Andrew Gray made changes -
            Field Original Value New Value
            Attachment nunit-selenium-testsuite.xml [ 29440 ]
            Hide
            kinow Bruno P. Kinoshita added a comment -

            Thank you. The problem seems to be related with the root element. Instead of test-results, your XML's root element is test-run.

            I couldn't find anywhere in NUnit site documenting about this backward compatibility change. Are you aware of such change?

            Show
            kinow Bruno P. Kinoshita added a comment - Thank you. The problem seems to be related with the root element. Instead of test-results, your XML's root element is test-run. I couldn't find anywhere in NUnit site documenting about this backward compatibility change. Are you aware of such change?
            Hide
            fsatmar Flaviu S added a comment -

            I also stumbled across the same issue, seems like the test results xml structure has changed a lot in nunit3. I will try to provide a sample from both versions if that helps.

            Show
            fsatmar Flaviu S added a comment - I also stumbled across the same issue, seems like the test results xml structure has changed a lot in nunit3. I will try to provide a sample from both versions if that helps.
            fsatmar Flaviu S made changes -
            Attachment nunit3_TestResult.xml [ 29884 ]
            Attachment nunit2_TestResult.xml [ 29885 ]
            Hide
            fsatmar Flaviu S added a comment - - edited

            Found some info about it on the nunit github page: https://github.com/nunit/nunit/wiki/XML-Formats
            Also there is a workaround, you can tell nunit3 console test runner to save the test results using the nunit2 xml schema by adding the following option: "--result:TestResult.xml;format=nunit2"

            Show
            fsatmar Flaviu S added a comment - - edited Found some info about it on the nunit github page: https://github.com/nunit/nunit/wiki/XML-Formats Also there is a workaround, you can tell nunit3 console test runner to save the test results using the nunit2 xml schema by adding the following option: "--result:TestResult.xml;format=nunit2"
            Hide
            scm_issue_link SCM/JIRA link daemon added a comment -

            Code changed in jenkins
            User: Bruno P. Kinoshita
            Path:
            src/test/java/hudson/plugins/nunit/NUnitReportTransformerTest.java
            src/test/resources/hudson/plugins/nunit/issue-27906.xml
            http://jenkins-ci.org/commit/nunit-plugin/0ca5a2ba4231405b3061925002317914f4c6856d
            Log:
            JENKINS-27906 Added test case

            Show
            scm_issue_link SCM/JIRA link daemon added a comment - Code changed in jenkins User: Bruno P. Kinoshita Path: src/test/java/hudson/plugins/nunit/NUnitReportTransformerTest.java src/test/resources/hudson/plugins/nunit/issue-27906.xml http://jenkins-ci.org/commit/nunit-plugin/0ca5a2ba4231405b3061925002317914f4c6856d Log: JENKINS-27906 Added test case
            Hide
            apgray Andrew Gray added a comment -

            Thanks for the workaround Flaviu S. That works for now.

            Show
            apgray Andrew Gray added a comment - Thanks for the workaround Flaviu S . That works for now.
            Hide
            breeves_tr Brian Reeves added a comment -

            The workaround isn't working for us. We're receiving the following error. Is there another workaround?
            --result:TestResultt_%BUILD_NUMBER%.xml;format=nunit2

            Error message:
            System.ArgumentException: Invalid XML output format 'nunit2'
            11:50:07 Parameter name: format
            11:50:07 at NUnit.Engine.Services.ResultService.GetResultWriter(String format, Object[] args)
            11:50:07 at NUnit.ConsoleRunner.ConsoleRunner.RunTests(TestPackage package, TestFilter filter)
            11:50:07 at NUnit.ConsoleRunner.ConsoleRunner.Execute()
            11:50:07 at NUnit.ConsoleRunner.Program.Main(String[] args)

            Show
            breeves_tr Brian Reeves added a comment - The workaround isn't working for us. We're receiving the following error. Is there another workaround? --result:TestResultt_%BUILD_NUMBER%.xml;format=nunit2 Error message: System.ArgumentException: Invalid XML output format 'nunit2' 11:50:07 Parameter name: format 11:50:07 at NUnit.Engine.Services.ResultService.GetResultWriter(String format, Object[] args) 11:50:07 at NUnit.ConsoleRunner.ConsoleRunner.RunTests(TestPackage package, TestFilter filter) 11:50:07 at NUnit.ConsoleRunner.ConsoleRunner.Execute() 11:50:07 at NUnit.ConsoleRunner.Program.Main(String[] args)
            Hide
            guson Jonas Gunnarsson added a comment -

            Hi!
            I'm having the same problem with NUnit 3 beta5.
            Adding the ;format=nunit2 to the --report parameter, seems to work.

            Attachments: jenkins-nunit3-error.txt
            Relates to: https://github.com/nunit/nunit/issues/853

            Show
            guson Jonas Gunnarsson added a comment - Hi! I'm having the same problem with NUnit 3 beta5 . Adding the ;format=nunit2 to the --report parameter, seems to work. Attachments: jenkins-nunit3-error.txt Relates to: https://github.com/nunit/nunit/issues/853
            guson Jonas Gunnarsson made changes -
            Attachment jenkins-nunit3-error.txt [ 30935 ]
            Hide
            breeves_tr Brian Reeves added a comment -

            We finally got this to work by putting in quotes.

            "--result:TestResult.xml;format=nunit2"

            Show
            breeves_tr Brian Reeves added a comment - We finally got this to work by putting in quotes. "--result:TestResult.xml;format=nunit2"
            Hide
            tenwit Paul Hicks added a comment -

            This is an NUnit3 results file that this plugin does not yet support. There is an XSLT file attached to issue JENKINS-32999 that can be used to transform this file to a JUnit results file.

            Show
            tenwit Paul Hicks added a comment - This is an NUnit3 results file that this plugin does not yet support. There is an XSLT file attached to issue JENKINS-32999 that can be used to transform this file to a JUnit results file.
            Hide
            wilson Wilson Li added a comment -

            Hi There I am currently having the same issue. I am trying to intergrate Nunit from Windows, appears that the Nuget managers' NUnit version is 3 something. I have tried running

            in the build step I use MSBuild to build the project.
            I then use a CMD Build with this command

            "C:\Program Files (x86)\NUnit.org\nunit-console\nunit3-console.exe" "C:\VisualStudios2015Repo\Mace E-Commerce Development\MACE_eCommerce_MAIN\Mace_E-Commerce_Project\WebUnitTest\bin\Debug\WebUnitTest.dll" /work:"C:\TestWeb" "--result:TestResult.xml;format=nunit2"
            cd C:\TestWeb\
            cd

            I then have a post Build process to publish the result
            The result is named TestResult.xml and is found in the C:\TestWeb

            I am getting the same error the fixes above have not resolved the issue.

            Please could anyone give any pointers

            The XML produced from the CMD command is attatched to this ticket Named "TestResult.xml"

            Here is the output by Jenkins:

            ============================================================

            Run Settings
            WorkDirectory: C:\TestWeb
            ImageRuntimeVersion: 4.0.30319
            ImageTargetFrameworkName: .NETFramework,Version=v4.5
            ImageRequiresX86: False
            ImageRequiresDefaultAppDomainAssemblyResolver: False
            NumberOfTestWorkers: 4

            Test Run Summary
            Overall result: Failed
            Test Count: 1, Passed: 0, Failed: 1, Inconclusive: 0, Skipped: 0
            Failed Tests - Failures: 1, Errors: 0, Invalid: 0
            Start time: 2016-04-07 10:38:59Z
            End time: 2016-04-07 10:38:59Z
            Duration: 0.150 seconds

            Results (nunit2) saved as TestResult.xml

            C:\Users\wilson.li\.jenkins\jobs\SlaveJobRunner\workspace>cd C:\TestWeb\

            C:\TestWeb>cd
            C:\TestWeb

            C:\TestWeb>exit 0
            Recording NUnit tests results
            ERROR: Step ‘Publish NUnit test result report’ aborted due to exception:
            hudson.util.IOException2: Could not transform the NUnit report. Please report this issue to the plugin author
            at hudson.plugins.nunit.NUnitArchiver.invoke(NUnitArchiver.java:68)
            at hudson.plugins.nunit.NUnitArchiver.invoke(NUnitArchiver.java:26)
            at hudson.FilePath.act(FilePath.java:990)
            at hudson.FilePath.act(FilePath.java:968)
            at hudson.plugins.nunit.NUnitPublisher.perform(NUnitPublisher.java:145)
            at hudson.tasks.BuildStepMonitor$1.perform(BuildStepMonitor.java:20)
            at hudson.model.AbstractBuild$AbstractBuildExecution.perform(AbstractBuild.java:782)
            at hudson.model.AbstractBuild$AbstractBuildExecution.performAllBuildSteps(AbstractBuild.java:723)
            at hudson.model.Build$BuildExecution.post2(Build.java:185)
            at hudson.model.AbstractBuild$AbstractBuildExecution.post(AbstractBuild.java:668)
            at hudson.model.Run.execute(Run.java:1763)
            at hudson.model.FreeStyleBuild.run(FreeStyleBuild.java:43)
            at hudson.model.ResourceController.execute(ResourceController.java:98)
            at hudson.model.Executor.run(Executor.java:410)
            Caused by: org.xml.sax.SAXParseException; systemId: file:/C:/Users/wilson.li/.jenkins/jobs/SlaveJobRunner/workspace/temporary-junit-reports/temp-junit.xml; lineNumber: 2; columnNumber: 3; Content is not allowed in prolog.
            at com.sun.org.apache.xerces.internal.parsers.DOMParser.parse(Unknown Source)
            at com.sun.org.apache.xerces.internal.jaxp.DocumentBuilderImpl.parse(Unknown Source)
            at javax.xml.parsers.DocumentBuilder.parse(Unknown Source)
            at hudson.plugins.nunit.NUnitReportTransformer.splitJUnitFile(NUnitReportTransformer.java:102)
            at hudson.plugins.nunit.NUnitReportTransformer.transform(NUnitReportTransformer.java:72)
            at hudson.plugins.nunit.NUnitArchiver.invoke(NUnitArchiver.java:63)
            ... 13 more
            Finished: FAILURE@Mention someone by typing their name...

            Show
            wilson Wilson Li added a comment - Hi There I am currently having the same issue. I am trying to intergrate Nunit from Windows, appears that the Nuget managers' NUnit version is 3 something. I have tried running in the build step I use MSBuild to build the project. I then use a CMD Build with this command "C:\Program Files (x86)\NUnit.org\nunit-console\nunit3-console.exe" "C:\VisualStudios2015Repo\Mace E-Commerce Development\MACE_eCommerce_MAIN\Mace_E-Commerce_Project\WebUnitTest\bin\Debug\WebUnitTest.dll" /work:"C:\TestWeb" "--result:TestResult.xml;format=nunit2" cd C:\TestWeb\ cd I then have a post Build process to publish the result The result is named TestResult.xml and is found in the C:\TestWeb I am getting the same error the fixes above have not resolved the issue. Please could anyone give any pointers The XML produced from the CMD command is attatched to this ticket Named "TestResult.xml" Here is the output by Jenkins: ============================================================ Run Settings WorkDirectory: C:\TestWeb ImageRuntimeVersion: 4.0.30319 ImageTargetFrameworkName: .NETFramework,Version=v4.5 ImageRequiresX86: False ImageRequiresDefaultAppDomainAssemblyResolver: False NumberOfTestWorkers: 4 Test Run Summary Overall result: Failed Test Count: 1, Passed: 0, Failed: 1, Inconclusive: 0, Skipped: 0 Failed Tests - Failures: 1, Errors: 0, Invalid: 0 Start time: 2016-04-07 10:38:59Z End time: 2016-04-07 10:38:59Z Duration: 0.150 seconds Results (nunit2) saved as TestResult.xml C:\Users\wilson.li\.jenkins\jobs\SlaveJobRunner\workspace>cd C:\TestWeb\ C:\TestWeb>cd C:\TestWeb C:\TestWeb>exit 0 Recording NUnit tests results ERROR: Step ‘Publish NUnit test result report’ aborted due to exception: hudson.util.IOException2: Could not transform the NUnit report. Please report this issue to the plugin author at hudson.plugins.nunit.NUnitArchiver.invoke(NUnitArchiver.java:68) at hudson.plugins.nunit.NUnitArchiver.invoke(NUnitArchiver.java:26) at hudson.FilePath.act(FilePath.java:990) at hudson.FilePath.act(FilePath.java:968) at hudson.plugins.nunit.NUnitPublisher.perform(NUnitPublisher.java:145) at hudson.tasks.BuildStepMonitor$1.perform(BuildStepMonitor.java:20) at hudson.model.AbstractBuild$AbstractBuildExecution.perform(AbstractBuild.java:782) at hudson.model.AbstractBuild$AbstractBuildExecution.performAllBuildSteps(AbstractBuild.java:723) at hudson.model.Build$BuildExecution.post2(Build.java:185) at hudson.model.AbstractBuild$AbstractBuildExecution.post(AbstractBuild.java:668) at hudson.model.Run.execute(Run.java:1763) at hudson.model.FreeStyleBuild.run(FreeStyleBuild.java:43) at hudson.model.ResourceController.execute(ResourceController.java:98) at hudson.model.Executor.run(Executor.java:410) Caused by: org.xml.sax.SAXParseException; systemId: file:/C:/Users/wilson.li/.jenkins/jobs/SlaveJobRunner/workspace/temporary-junit-reports/temp-junit.xml ; lineNumber: 2; columnNumber: 3; Content is not allowed in prolog. at com.sun.org.apache.xerces.internal.parsers.DOMParser.parse(Unknown Source) at com.sun.org.apache.xerces.internal.jaxp.DocumentBuilderImpl.parse(Unknown Source) at javax.xml.parsers.DocumentBuilder.parse(Unknown Source) at hudson.plugins.nunit.NUnitReportTransformer.splitJUnitFile(NUnitReportTransformer.java:102) at hudson.plugins.nunit.NUnitReportTransformer.transform(NUnitReportTransformer.java:72) at hudson.plugins.nunit.NUnitArchiver.invoke(NUnitArchiver.java:63) ... 13 more Finished: FAILURE@Mention someone by typing their name...
            wilson Wilson Li made changes -
            Attachment TestResult.xml [ 32375 ]
            wilson Wilson Li made changes -
            Priority Minor [ 4 ] Major [ 3 ]
            Hide
            yieldwatchdog Fikret Abdic added a comment -

            You have to change 2 things to get this working! (Some people forget the second one)

            Add this to your build command:
            /xml:nunit-result_%BUILD_NUMBER%_%SVN_REVISION%.xml;format=nunit2

            And this to the section Post Build under Publish Reports
            nunit-result_%BUILD_NUMBER%_%SVN_REVISION%.xml

            Show
            yieldwatchdog Fikret Abdic added a comment - You have to change 2 things to get this working! (Some people forget the second one) Add this to your build command: /xml:nunit-result_%BUILD_NUMBER%_%SVN_REVISION%.xml;format=nunit2 And this to the section Post Build under Publish Reports nunit-result_%BUILD_NUMBER%_%SVN_REVISION%.xml
            rtyler R. Tyler Croy made changes -
            Workflow JNJira [ 162500 ] JNJira + In-Review [ 180949 ]
            Hide
            vbandaru Venkateswara Rao Bandaru added a comment -

            Croy please let me when can we expect the changes to be submitted related to this.

            Show
            vbandaru Venkateswara Rao Bandaru added a comment - Croy please let me when can we expect the changes to be submitted related to this.
            Hide
            talcloudshare Tal Auslander added a comment -

            This also affects .NET Core testing, in which the output format cannot be changed to NUnit 2

            Show
            talcloudshare Tal Auslander added a comment - This also affects .NET Core testing , in which the output format cannot be changed to NUnit 2
            Hide
            naicigam Juan Alvarez added a comment -

            I am having the same issue with .NET Core testing.

            Show
            naicigam Juan Alvarez added a comment - I am having the same issue with .NET Core testing.
            Hide
            kristan Kristan Stewart added a comment -

            I am having this issue as well. Particularly i want to use NUnit 3, rather than converting to nunit 2.

            Are there plans to update the plugin to be able to handle NUnit 3 ?

            Show
            kristan Kristan Stewart added a comment - I am having this issue as well. Particularly i want to use NUnit 3, rather than converting to nunit 2. Are there plans to update the plugin to be able to handle NUnit 3 ?
            Hide
            tenwit Paul Hicks added a comment -

            Until it is updated, you can use the JUnit plugin and the NUnit3-JUnit.xslt file that comes with nunit. You can find it on https://github.com/nunit/nunit-transforms/tree/master/nunit3-junit

            Show
            tenwit Paul Hicks added a comment - Until it is updated, you can use the JUnit plugin and the NUnit3-JUnit.xslt file that comes with nunit. You can find it on https://github.com/nunit/nunit-transforms/tree/master/nunit3-junit
            Hide
            beastostbg Yannick FRINDEL added a comment - - edited

            same issue. Until it is fixed, the only solution I have consist to transform my results in a nunit2 xml result file.
            But with this solution I have less information in my xml file...

            Show
            beastostbg Yannick FRINDEL added a comment - - edited same issue. Until it is fixed, the only solution I have consist to transform my results in a nunit2 xml result file. But with this solution I have less information in my xml file...
            apgray Andrew Gray made changes -
            Priority Major [ 3 ] Critical [ 2 ]
            Hide
            apgray Andrew Gray added a comment -

            This really is a Critical issue. It causes downstream issues with new tools that take NUnit 3 XML as input.

            Show
            apgray Andrew Gray added a comment - This really is a Critical issue. It causes downstream issues with new tools that take NUnit 3 XML as input.
            Hide
            tenwit Paul Hicks added a comment - - edited

            The plugin is currently NUnit2 only. This is a request for a new feature, not a bug. The plugin doesn't claim to support NUnit 3 yet.
            Until it does, you can use the the XSLT transform to convert your NUNit3 xml to JUnit xml, which Jenkins can handle. I don't think there's any loss of information doing this (at least, I haven't noticed any).

            Show
            tenwit Paul Hicks added a comment - - edited The plugin is currently NUnit2 only. This is a request for a new feature, not a bug. The plugin doesn't claim to support NUnit 3 yet. Until it does, you can use the the XSLT transform to convert your NUNit3 xml to JUnit xml, which Jenkins can handle. I don't think there's any loss of information doing this (at least, I haven't noticed any).
            Hide
            apgray Andrew Gray added a comment -

            Hi Paul, Thanks for the link. I disagee with your reasoning though. The plugin may have been written when NUnit 2 was current but it should evolve to handle NUnit3, 4 , 5 etc. It is a bug that is doesn't currently support it.

            Show
            apgray Andrew Gray added a comment - Hi Paul, Thanks for the link. I disagee with your reasoning though. The plugin may have been written when NUnit 2 was current but it should evolve to handle NUnit3, 4 , 5 etc. It is a bug that is doesn't currently support it.
            Hide
            apgray Andrew Gray added a comment - - edited

            Message received from Charlie Poole (lead developer of NUnit):

            "To add a bit to your concerns, NUnit 3.6 for the first time produces
            outcomes that can't be translated to the NUnit 2 format. Warnings
            simply won't appear and multiple assert failures, while showing a
            consolidated message, won't show separate stack traces for each error.
            There's no way for this information to be reproduced in the NUnit 2
            format, so we haven't tried.

            I think we can predict that coming releases will add other features
            that can't be represented in the legacy format."

            All the more reason Jenkins has to be able to read NUnit3. We simply have to consign NUnit 2 to the history books!

            Show
            apgray Andrew Gray added a comment - - edited Message received from Charlie Poole (lead developer of NUnit): "To add a bit to your concerns, NUnit 3.6 for the first time produces outcomes that can't be translated to the NUnit 2 format. Warnings simply won't appear and multiple assert failures, while showing a consolidated message, won't show separate stack traces for each error. There's no way for this information to be reproduced in the NUnit 2 format, so we haven't tried. I think we can predict that coming releases will add other features that can't be represented in the legacy format." All the more reason Jenkins has to be able to read NUnit3. We simply have to consign NUnit 2 to the history books!
            Hide
            tenwit Paul Hicks added a comment -

            Perhaps the bug is that the plugin should be called the NUnit2 plugin.

            Show
            tenwit Paul Hicks added a comment - Perhaps the bug is that the plugin should be called the NUnit2 plugin.
            Hide
            rhutchison Ryan Hutchison added a comment -

            the nunit3-junit transform works great - thanks Paul Hicks

            Would be nice if this plugin could be updated.

            Show
            rhutchison Ryan Hutchison added a comment - the nunit3-junit transform works great - thanks Paul Hicks Would be nice if this plugin could be updated.
            slide_o_mix Alex Earl made changes -
            Link This issue is duplicated by JENKINS-37879 [ JENKINS-37879 ]
            slide_o_mix Alex Earl made changes -
            Link This issue is duplicated by JENKINS-32999 [ JENKINS-32999 ]
            slide_o_mix Alex Earl made changes -
            Link This issue is duplicated by JENKINS-30921 [ JENKINS-30921 ]
            slide_o_mix Alex Earl made changes -
            Attachment nunit.hpi [ 36203 ]
            Hide
            slide_o_mix Alex Earl added a comment -

            Please try the attached nunit.hpi if you can and see if it works for nunit3. I don't personally have an nunit3 project I can test.

            Show
            slide_o_mix Alex Earl added a comment - Please try the attached nunit.hpi if you can and see if it works for nunit3. I don't personally have an nunit3 project I can test.
            Hide
            bdominguez Borja Domínguez added a comment -

            Please, support NUnit 3.

            It was released a year and a half ago: https://github.com/nunit/docs/wiki/Release-Notes

            Show
            bdominguez Borja Domínguez added a comment - Please, support NUnit 3. It was released a year and a half ago:  https://github.com/nunit/docs/wiki/Release-Notes
            Hide
            slide_o_mix Alex Earl added a comment -

            Should have a release soon, was just on vacation. The test version I uploaded to this ticket could be used in the interim.

            Show
            slide_o_mix Alex Earl added a comment - Should have a release soon, was just on vacation. The test version I uploaded to this ticket could be used in the interim.
            Hide
            hugues_massot Hugues Massot added a comment -

            Hi,

            I'm new to Jenkins, NUnit, C#,...but I just wanted to say that your hpi file worked fine for my configuration

            Thanks

            Show
            hugues_massot Hugues Massot added a comment - Hi, I'm new to Jenkins, NUnit, C#,...but I just wanted to say that your hpi file worked fine for my configuration Thanks
            slide_o_mix Alex Earl made changes -
            Assignee Bruno P. Kinoshita [ kinow ] Alex Earl [ slide_o_mix ]
            Hide
            bdominguez Borja Domínguez added a comment -

            Any news on this?

            Show
            bdominguez Borja Domínguez added a comment - Any news on this?
            Hide
            slide_o_mix Alex Earl added a comment -

            Yes, I should be doing a release soon. I'm cleaning up some other issues as well.

            Show
            slide_o_mix Alex Earl added a comment - Yes, I should be doing a release soon. I'm cleaning up some other issues as well.
            Hide
            scm_issue_link SCM/JIRA link daemon added a comment -

            Code changed in jenkins
            User: Alex Earl
            Path:
            pom.xml
            src/main/java/hudson/plugins/nunit/NUnitArchiver.java
            src/main/java/hudson/plugins/nunit/NUnitPublisher.java
            src/main/java/hudson/plugins/nunit/NUnitReportTransformer.java
            src/main/resources/hudson/plugins/nunit/NUnitPublisher/config.jelly
            src/main/resources/index.jelly
            src/test/java/hudson/plugins/nunit/NUnitArchiverTest.java
            src/test/java/hudson/plugins/nunit/NUnitIntegrationTest.java
            src/test/java/hudson/plugins/nunit/NUnitPublisherTest.java
            src/test/java/hudson/plugins/nunit/NUnitReportTransformerTest.java
            src/test/java/hudson/plugins/nunit/NUnitToJUnitXslTest.java
            src/test/resources/hudson/plugins/nunit/NUnit-issue34452.xml
            http://jenkins-ci.org/commit/nunit-plugin/5bd699cedeae13475a3321637da3d5c47397b362
            Log:
            Fix JENKINS-27618, JENKINS-27906, JENKINS-34452, JENKINS-42967

            Show
            scm_issue_link SCM/JIRA link daemon added a comment - Code changed in jenkins User: Alex Earl Path: pom.xml src/main/java/hudson/plugins/nunit/NUnitArchiver.java src/main/java/hudson/plugins/nunit/NUnitPublisher.java src/main/java/hudson/plugins/nunit/NUnitReportTransformer.java src/main/resources/hudson/plugins/nunit/NUnitPublisher/config.jelly src/main/resources/index.jelly src/test/java/hudson/plugins/nunit/NUnitArchiverTest.java src/test/java/hudson/plugins/nunit/NUnitIntegrationTest.java src/test/java/hudson/plugins/nunit/NUnitPublisherTest.java src/test/java/hudson/plugins/nunit/NUnitReportTransformerTest.java src/test/java/hudson/plugins/nunit/NUnitToJUnitXslTest.java src/test/resources/hudson/plugins/nunit/NUnit-issue34452.xml http://jenkins-ci.org/commit/nunit-plugin/5bd699cedeae13475a3321637da3d5c47397b362 Log: Fix JENKINS-27618 , JENKINS-27906 , JENKINS-34452 , JENKINS-42967
            Hide
            slide_o_mix Alex Earl added a comment -

            Will be fixed in 0.19

            Show
            slide_o_mix Alex Earl added a comment - Will be fixed in 0.19
            slide_o_mix Alex Earl made changes -
            Status Open [ 1 ] Resolved [ 5 ]
            Resolution Fixed [ 1 ]
            Hide
            aurelianus Aurelianus Victor added a comment -

            when will 0.19 be available?

            Show
            aurelianus Aurelianus Victor added a comment - when will 0.19 be available?
            Hide
            bdominguez Borja Domínguez added a comment -

            I'm also interested on that.

            Show
            bdominguez Borja Domínguez added a comment - I'm also interested on that.
            Hide
            slide_o_mix Alex Earl added a comment -

            My apologies, my build machine went down, I hope to have it back up very soon and then I will do the release.

            Show
            slide_o_mix Alex Earl added a comment - My apologies, my build machine went down, I hope to have it back up very soon and then I will do the release.

              People

              • Assignee:
                slide_o_mix Alex Earl
                Reporter:
                apgray Andrew Gray
              • Votes:
                25 Vote for this issue
                Watchers:
                40 Start watching this issue

                Dates

                • Created:
                  Updated:
                  Resolved: