Uploaded image for project: 'Jenkins'
  1. Jenkins
  2. JENKINS-51290

Property step causes builds fail to start with: IOException: repo/branch #5 did not yet start if previous build failed without getting an execution

    XMLWordPrintable

    Details

    • Similar Issues:

      Description

      Multibranch Pipelines fail to start with:

      Setting origin to git@gitlab:xxx/yyy.git
      Fetching origin...
      Obtained Jenkinsfile from <sha1>
      Running in Durability level: MAX_SURVIVABILITY
      [Pipeline] properties
      [Pipeline] End of Pipeline
      java.io.IOException: yyy/feature-y #5 did not yet start
      	at org.jenkinsci.plugins.workflow.job.WorkflowRun$Owner.get(WorkflowRun.java:1104)
      	at org.jenkinsci.plugins.workflow.multibranch.JobPropertyStep$Execution.run(JobPropertyStep.java:104)
      	at org.jenkinsci.plugins.workflow.multibranch.JobPropertyStep$Execution.run(JobPropertyStep.java:84)
      	at org.jenkinsci.plugins.workflow.steps.AbstractSynchronousStepExecution.start(AbstractSynchronousStepExecution.java:42)
      	at org.jenkinsci.plugins.workflow.cps.DSL.invokeStep(DSL.java:229)
      	at org.jenkinsci.plugins.workflow.cps.DSL.invokeMethod(DSL.java:153)
      	at org.jenkinsci.plugins.workflow.cps.CpsScript.invokeMethod(CpsScript.java:122)
      	at sun.reflect.NativeMethodAccessorImpl.invoke0(Native Method)
      	at sun.reflect.NativeMethodAccessorImpl.invoke(NativeMethodAccessorImpl.java:62)
      	at sun.reflect.DelegatingMethodAccessorImpl.invoke(DelegatingMethodAccessorImpl.java:43)
      	at java.lang.reflect.Method.invoke(Method.java:498)
      	at org.codehaus.groovy.reflection.CachedMethod.invoke(CachedMethod.java:93)
      	at groovy.lang.MetaMethod.doMethodInvoke(MetaMethod.java:325)
      	at groovy.lang.MetaClassImpl.invokeMethod(MetaClassImpl.java:1213)
      	at groovy.lang.MetaClassImpl.invokeMethod(MetaClassImpl.java:1022)
      	at org.codehaus.groovy.runtime.callsite.PogoMetaClassSite.call(PogoMetaClassSite.java:42)
      	at org.codehaus.groovy.runtime.callsite.CallSiteArray.defaultCall(CallSiteArray.java:48)
      	at org.codehaus.groovy.runtime.callsite.AbstractCallSite.call(AbstractCallSite.java:113)
      	at org.kohsuke.groovy.sandbox.impl.Checker$1.call(Checker.java:157)
      	at org.kohsuke.groovy.sandbox.GroovyInterceptor.onMethodCall(GroovyInterceptor.java:23)
      	at org.jenkinsci.plugins.scriptsecurity.sandbox.groovy.SandboxInterceptor.onMethodCall(SandboxInterceptor.java:133)
      	at org.jenkinsci.plugins.scriptsecurity.sandbox.groovy.SandboxInterceptor.onMethodCall(SandboxInterceptor.java:120)
      	at org.kohsuke.groovy.sandbox.impl.Checker$1.call(Checker.java:155)
      	at org.kohsuke.groovy.sandbox.impl.Checker.checkedCall(Checker.java:159)
      	at com.cloudbees.groovy.cps.sandbox.SandboxInvoker.methodCall(SandboxInvoker.java:17)
      	at WorkflowScript.run(WorkflowScript:15)
      	at ___cps.transform___(Native Method)
      	at com.cloudbees.groovy.cps.impl.ContinuationGroup.methodCall(ContinuationGroup.java:57)
      	at com.cloudbees.groovy.cps.impl.FunctionCallBlock$ContinuationImpl.dispatchOrArg(FunctionCallBlock.java:109)
      	at com.cloudbees.groovy.cps.impl.FunctionCallBlock$ContinuationImpl.fixArg(FunctionCallBlock.java:82)
      	at sun.reflect.NativeMethodAccessorImpl.invoke0(Native Method)
      	at sun.reflect.NativeMethodAccessorImpl.invoke(NativeMethodAccessorImpl.java:62)
      	at sun.reflect.DelegatingMethodAccessorImpl.invoke(DelegatingMethodAccessorImpl.java:43)
      	at java.lang.reflect.Method.invoke(Method.java:498)
      	at com.cloudbees.groovy.cps.impl.ContinuationPtr$ContinuationImpl.receive(ContinuationPtr.java:72)
      	at com.cloudbees.groovy.cps.impl.CollectionLiteralBlock$ContinuationImpl.dispatch(CollectionLiteralBlock.java:55)
      	at com.cloudbees.groovy.cps.impl.CollectionLiteralBlock$ContinuationImpl.item(CollectionLiteralBlock.java:45)
      	at sun.reflect.NativeMethodAccessorImpl.invoke0(Native Method)
      	at sun.reflect.NativeMethodAccessorImpl.invoke(NativeMethodAccessorImpl.java:62)
      	at sun.reflect.DelegatingMethodAccessorImpl.invoke(DelegatingMethodAccessorImpl.java:43)
      	at java.lang.reflect.Method.invoke(Method.java:498)
      	at com.cloudbees.groovy.cps.impl.ContinuationPtr$ContinuationImpl.receive(ContinuationPtr.java:72)
      	at com.cloudbees.groovy.cps.impl.ContinuationGroup.methodCall(ContinuationGroup.java:60)
      	at com.cloudbees.groovy.cps.impl.FunctionCallBlock$ContinuationImpl.dispatchOrArg(FunctionCallBlock.java:109)
      	at com.cloudbees.groovy.cps.impl.FunctionCallBlock$ContinuationImpl.fixArg(FunctionCallBlock.java:82)
      	at sun.reflect.NativeMethodAccessorImpl.invoke0(Native Method)
      	at sun.reflect.NativeMethodAccessorImpl.invoke(NativeMethodAccessorImpl.java:62)
      	at sun.reflect.DelegatingMethodAccessorImpl.invoke(DelegatingMethodAccessorImpl.java:43)
      	at java.lang.reflect.Method.invoke(Method.java:498)
      	at com.cloudbees.groovy.cps.impl.ContinuationPtr$ContinuationImpl.receive(ContinuationPtr.java:72)
      	at com.cloudbees.groovy.cps.impl.ContinuationGroup.methodCall(ContinuationGroup.java:60)
      	at com.cloudbees.groovy.cps.impl.FunctionCallBlock$ContinuationImpl.dispatchOrArg(FunctionCallBlock.java:109)
      	at com.cloudbees.groovy.cps.impl.FunctionCallBlock$ContinuationImpl.fixArg(FunctionCallBlock.java:82)
      	at sun.reflect.NativeMethodAccessorImpl.invoke0(Native Method)
      	at sun.reflect.NativeMethodAccessorImpl.invoke(NativeMethodAccessorImpl.java:62)
      	at sun.reflect.DelegatingMethodAccessorImpl.invoke(DelegatingMethodAccessorImpl.java:43)
      	at java.lang.reflect.Method.invoke(Method.java:498)
      	at com.cloudbees.groovy.cps.impl.ContinuationPtr$ContinuationImpl.receive(ContinuationPtr.java:72)
      	at com.cloudbees.groovy.cps.impl.CollectionLiteralBlock$ContinuationImpl.dispatch(CollectionLiteralBlock.java:55)
      	at com.cloudbees.groovy.cps.impl.CollectionLiteralBlock$ContinuationImpl.item(CollectionLiteralBlock.java:45)
      	at sun.reflect.NativeMethodAccessorImpl.invoke0(Native Method)
      	at sun.reflect.NativeMethodAccessorImpl.invoke(NativeMethodAccessorImpl.java:62)
      	at sun.reflect.DelegatingMethodAccessorImpl.invoke(DelegatingMethodAccessorImpl.java:43)
      	at java.lang.reflect.Method.invoke(Method.java:498)
      	at com.cloudbees.groovy.cps.impl.ContinuationPtr$ContinuationImpl.receive(ContinuationPtr.java:72)
      	at com.cloudbees.groovy.cps.impl.ConstantBlock.eval(ConstantBlock.java:21)
      	at com.cloudbees.groovy.cps.Next.step(Next.java:83)
      	at com.cloudbees.groovy.cps.Continuable$1.call(Continuable.java:174)
      	at com.cloudbees.groovy.cps.Continuable$1.call(Continuable.java:163)
      	at org.codehaus.groovy.runtime.GroovyCategorySupport$ThreadCategoryInfo.use(GroovyCategorySupport.java:122)
      	at org.codehaus.groovy.runtime.GroovyCategorySupport.use(GroovyCategorySupport.java:261)
      	at com.cloudbees.groovy.cps.Continuable.run0(Continuable.java:163)
      	at org.jenkinsci.plugins.workflow.cps.SandboxContinuable.access$101(SandboxContinuable.java:34)
      	at org.jenkinsci.plugins.workflow.cps.SandboxContinuable.lambda$run0$0(SandboxContinuable.java:59)
      	at org.jenkinsci.plugins.scriptsecurity.sandbox.groovy.GroovySandbox.runInSandbox(GroovySandbox.java:108)
      	at org.jenkinsci.plugins.workflow.cps.SandboxContinuable.run0(SandboxContinuable.java:58)
      	at org.jenkinsci.plugins.workflow.cps.CpsThread.runNextChunk(CpsThread.java:174)
      	at org.jenkinsci.plugins.workflow.cps.CpsThreadGroup.run(CpsThreadGroup.java:332)
      	at org.jenkinsci.plugins.workflow.cps.CpsThreadGroup.access$200(CpsThreadGroup.java:83)
      	at org.jenkinsci.plugins.workflow.cps.CpsThreadGroup$2.call(CpsThreadGroup.java:244)
      	at org.jenkinsci.plugins.workflow.cps.CpsThreadGroup$2.call(CpsThreadGroup.java:232)
      	at org.jenkinsci.plugins.workflow.cps.CpsVmExecutorService$2.call(CpsVmExecutorService.java:64)
      	at java.util.concurrent.FutureTask.run(FutureTask.java:266)
      	at hudson.remoting.SingleLaneExecutorService$1.run(SingleLaneExecutorService.java:131)
      	at jenkins.util.ContextResettingExecutorService$1.run(ContextResettingExecutorService.java:28)
      	at jenkins.security.ImpersonatingExecutorService$1.run(ImpersonatingExecutorService.java:59)
      	at java.util.concurrent.Executors$RunnableAdapter.call(Executors.java:511)
      	at java.util.concurrent.FutureTask.run(FutureTask.java:266)
      	at java.util.concurrent.ThreadPoolExecutor.runWorker(ThreadPoolExecutor.java:1149)
      	at java.util.concurrent.ThreadPoolExecutor$Worker.run(ThreadPoolExecutor.java:624)
      	at java.lang.Thread.run(Thread.java:748)
      Finished: FAILURE
      

      Line 15 in my Jenkinsfile is:

      properties([
      	gitLabConnection('enggit'),
      	buildDiscarder(logRotator(artifactDaysToKeepStr: '', artifactNumToKeepStr: '', daysToKeepStr: '90', numToKeepStr: ''))
      ])
      

      Downgrading workflow-cps to 2.52 allows my builds to start again

        Attachments

          Issue Links

            Activity

            Hide
            oleg_nenashev Oleg Nenashev added a comment -

            Sam Van Oort Today Pham Vu Tuan hit it on ci.jenkins.io: https://ci.jenkins.io/job/Plugins/job/remoting-kafka-plugin/job/PR-1/3/display/redirect . It happens for properties() step there with a standard buildPlugin() there. Maybe it could help with troubleshooting

            Show
            oleg_nenashev Oleg Nenashev added a comment - Sam Van Oort Today Pham Vu Tuan hit it on ci.jenkins.io: https://ci.jenkins.io/job/Plugins/job/remoting-kafka-plugin/job/PR-1/3/display/redirect . It happens for properties() step there with a standard buildPlugin() there. Maybe it could help with troubleshooting
            Hide
            scm_issue_link SCM/JIRA link daemon added a comment -

            Code changed in jenkins
            User: Sam Van Oort
            Path:
            pom.xml
            src/main/java/org/jenkinsci/plugins/workflow/multibranch/JobPropertyStep.java
            src/test/java/org/jenkinsci/plugins/workflow/multibranch/JobPropertyStepTest.java
            http://jenkins-ci.org/commit/workflow-multibranch-plugin/0a06168aa4d21f8418d30bb904bcf0c4bff5c8cb
            Log:
            Test and fix for JENKINS-51290 - properties step error about job not yet started if could not obtain execution for previous run

            Show
            scm_issue_link SCM/JIRA link daemon added a comment - Code changed in jenkins User: Sam Van Oort Path: pom.xml src/main/java/org/jenkinsci/plugins/workflow/multibranch/JobPropertyStep.java src/test/java/org/jenkinsci/plugins/workflow/multibranch/JobPropertyStepTest.java http://jenkins-ci.org/commit/workflow-multibranch-plugin/0a06168aa4d21f8418d30bb904bcf0c4bff5c8cb Log: Test and fix for JENKINS-51290 - properties step error about job not yet started if could not obtain execution for previous run
            Hide
            scm_issue_link SCM/JIRA link daemon added a comment -

            Code changed in jenkins
            User: Sam Van Oort
            Path:
            pom.xml
            src/main/java/org/jenkinsci/plugins/workflow/multibranch/JobPropertyStep.java
            src/test/java/org/jenkinsci/plugins/workflow/multibranch/JobPropertyStepTest.java
            http://jenkins-ci.org/commit/workflow-multibranch-plugin/273871d02da5bc533bac258052b1987d4ffdc6b8
            Log:
            Merge pull request #75 from svanoort/fix-properties-didnotyetstart-error-jenkins-51290

            Test and fix for JENKINS-51290 - properties step fails with error about job not yet started if could not obtain execution for previous run

            Compare: https://github.com/jenkinsci/workflow-multibranch-plugin/compare/74368e4623cb...273871d02da5
            *NOTE:* This service been marked for deprecation: https://developer.github.com/changes/2018-04-25-github-services-deprecation/

            Functionality will be removed from GitHub.com on January 31st, 2019.

            Show
            scm_issue_link SCM/JIRA link daemon added a comment - Code changed in jenkins User: Sam Van Oort Path: pom.xml src/main/java/org/jenkinsci/plugins/workflow/multibranch/JobPropertyStep.java src/test/java/org/jenkinsci/plugins/workflow/multibranch/JobPropertyStepTest.java http://jenkins-ci.org/commit/workflow-multibranch-plugin/273871d02da5bc533bac258052b1987d4ffdc6b8 Log: Merge pull request #75 from svanoort/fix-properties-didnotyetstart-error-jenkins-51290 Test and fix for JENKINS-51290 - properties step fails with error about job not yet started if could not obtain execution for previous run Compare: https://github.com/jenkinsci/workflow-multibranch-plugin/compare/74368e4623cb...273871d02da5 * NOTE: * This service been marked for deprecation: https://developer.github.com/changes/2018-04-25-github-services-deprecation/ Functionality will be removed from GitHub.com on January 31st, 2019.
            Hide
            svanoort Sam Van Oort added a comment -

            This was yet-more fallout from the lazy-loading feature added in workflow-job 2.18, and the fix to workflow-multibranch to deal with that (added in 2.17) which did one handle an edge case correctly.

            Show
            svanoort Sam Van Oort added a comment - This was yet-more fallout from the lazy-loading feature added in workflow-job 2.18, and the fix to workflow-multibranch to deal with that (added in 2.17) which did one handle an edge case correctly.
            Hide
            svanoort Sam Van Oort added a comment -

            released with workflow-multibranch 2.18

            Show
            svanoort Sam Van Oort added a comment - released with workflow-multibranch 2.18

              People

              • Assignee:
                svanoort Sam Van Oort
                Reporter:
                cobexer Ing. Christoph Obexer
              • Votes:
                1 Vote for this issue
                Watchers:
                5 Start watching this issue

                Dates

                • Created:
                  Updated:
                  Resolved: