Uploaded image for project: 'Jenkins'
  1. Jenkins
  2. JENKINS-55099

Mailer Plugin PCT fails on 2.150...2.155

    Details

    • Similar Issues:

      Description

      Mailer plugin PCT fails when running against 2.155 and 2.153

      === Starting testHudsonUrlCompatibility(hudson.tasks.MailerTest) Dec 10, 2018 11:12:42 AM hudson.ExtensionFinder$GuiceFinder$FaultTolerantScope$1 error WARNING: Failed to instantiate Key[type=jenkins.slaves.JnlpSlaveAgentProtocol4, annotation=[none]]; skipping this component com.google.inject.ProvisionException: Unable to provision, see the following errors: 1) Error injecting constructor, java.security.KeyStoreException: JENKINS-41987: no X509Certificate found; perhaps instance-identity module is missing or too old   at jenkins.slaves.JnlpSlaveAgentProtocol4.<init>(JnlpSlaveAgentProtocol4.java:103) 1 error at com.google.inject.internal.ProviderToInternalFactoryAdapter.get(ProviderToInternalFactoryAdapter.java:52) at com.google.inject.internal.SingletonScope$1.get(SingletonScope.java:145) at hudson.ExtensionFinder$GuiceFinder$FaultTolerantScope$1.get(ExtensionFinder.java:440) at com.google.inject.internal.InternalFactoryToProviderAdapter.get(InternalFactoryToProviderAdapter.java:41) at com.google.inject.internal.InjectorImpl$2$1.call(InjectorImpl.java:1016) at com.google.inject.internal.InjectorImpl.callInContext(InjectorImpl.java:1092) at com.google.inject.internal.InjectorImpl$2.get(InjectorImpl.java:1012) at hudson.ExtensionFinder$GuiceFinder._find(ExtensionFinder.java:402) at hudson.ExtensionFinder$GuiceFinder.find(ExtensionFinder.java:393) at hudson.ClassicPluginStrategy.findComponents(ClassicPluginStrategy.java:494) at hudson.ExtensionList.load(ExtensionList.java:380) at hudson.ExtensionList.ensureLoaded(ExtensionList.java:318) at hudson.ExtensionList.iterator(ExtensionList.java:172) at jenkins.model.Jenkins.getAgentProtocols(Jenkins.java:1181) at jenkins.slaves.DeprecatedAgentProtocolMonitor.isActivated(DeprecatedAgentProtocolMonitor.java:63) at jenkins.model.Jenkins.lambda$getActiveAdministrativeMonitors$0(Jenkins.java:2142) at java.util.stream.ReferencePipeline$2$1.accept(ReferencePipeline.java:174) at java.util.Iterator.forEachRemaining(Iterator.java:116) at java.util.Spliterators$IteratorSpliterator.forEachRemaining(Spliterators.java:1801) at java.util.stream.AbstractPipeline.copyInto(AbstractPipeline.java:481) at java.util.stream.AbstractPipeline.wrapAndCopyInto(AbstractPipeline.java:471) at java.util.stream.ReduceOps$ReduceOp.evaluateSequential(ReduceOps.java:708) at java.util.stream.AbstractPipeline.evaluate(AbstractPipeline.java:234) at java.util.stream.ReferencePipeline.collect(ReferencePipeline.java:499) at jenkins.model.Jenkins.getActiveAdministrativeMonitors(Jenkins.java:2142) at jenkins.management.AdministrativeMonitorsDecorator.getActiveAdministrativeMonitors(AdministrativeMonitorsDecorator.java:81) at jenkins.management.AdministrativeMonitorsDecorator.getActiveAdministrativeMonitorsCount(AdministrativeMonitorsDecorator.java:76) at jenkins.management.AdministrativeMonitorsDecorator.shouldDisplay(AdministrativeMonitorsDecorator.java:139) at sun.reflect.GeneratedMethodAccessor322.invoke(Unknown Source) at sun.reflect.DelegatingMethodAccessorImpl.invoke(DelegatingMethodAccessorImpl.java:43) at java.lang.reflect.Method.invoke(Method.java:498) at org.apache.commons.jexl.util.introspection.UberspectImpl$VelMethodImpl.invoke(UberspectImpl.java:258) at org.apache.commons.jexl.parser.ASTMethod.execute(ASTMethod.java:104) at org.apache.commons.jexl.parser.ASTReference.execute(ASTReference.java:83) at org.apache.commons.jexl.parser.ASTReference.value(ASTReference.java:57) at org.apache.commons.jexl.parser.ASTReferenceExpression.value(ASTReferenceExpression.java:51) at org.apache.commons.jexl.ExpressionImpl.evaluate(ExpressionImpl.java:80) at hudson.ExpressionFactory2$JexlExpression.evaluate(ExpressionFactory2.java:74) at org.apache.commons.jelly.expression.ExpressionSupport.evaluateRecurse(ExpressionSupport.java:61) at org.apache.commons.jelly.expression.ExpressionSupport.evaluateAsBoolean(ExpressionSupport.java:71) at org.apache.commons.jelly.tags.core.CoreTagLibrary$1.run(CoreTagLibrary.java:97) at org.apache.commons.jelly.tags.core.CoreTagLibrary$2.run(CoreTagLibrary.java:105) at org.kohsuke.stapler.jelly.JellyViewScript.run(JellyViewScript.java:95) at org.kohsuke.stapler.jelly.IncludeTag.doTag(IncludeTag.java:147) at org.apache.commons.jelly.impl.TagScript.run(TagScript.java:269) at org.apache.commons.jelly.TagSupport.invokeBody(TagSupport.java:161) at org.apache.commons.jelly.tags.core.ForEachTag.doTag(ForEachTag.java:150) at org.apache.commons.jelly.impl.TagScript.run(TagScript.java:269) at org.apache.commons.jelly.tags.core.CoreTagLibrary$1.run(CoreTagLibrary.java:98) at org.apache.commons.jelly.impl.ScriptBlock.run(ScriptBlock.java:95) at org.kohsuke.stapler.jelly.ReallyStaticTagLibrary$1.run(ReallyStaticTagLibrary.java:99) at org.apache.commons.jelly.impl.ScriptBlock.run(ScriptBlock.java:95) at org.kohsuke.stapler.jelly.ReallyStaticTagLibrary$1.run(ReallyStaticTagLibrary.java:99) at org.kohsuke.stapler.jelly.ReallyStaticTagLibrary$1.run(ReallyStaticTagLibrary.java:99) at org.kohsuke.stapler.jelly.ReallyStaticTagLibrary$1.run(ReallyStaticTagLibrary.java:99) at org.apache.commons.jelly.tags.core.CoreTagLibrary$1.run(CoreTagLibrary.java:98) at org.apache.commons.jelly.impl.ScriptBlock.run(ScriptBlock.java:95) at org.kohsuke.stapler.jelly.ReallyStaticTagLibrary$1.run(ReallyStaticTagLibrary.java:99) at org.apache.commons.jelly.impl.ScriptBlock.run(ScriptBlock.java:95) at org.kohsuke.stapler.jelly.ReallyStaticTagLibrary$1.run(ReallyStaticTagLibrary.java:99) at org.apache.commons.jelly.impl.ScriptBlock.run(ScriptBlock.java:95) at org.apache.commons.jelly.tags.core.CoreTagLibrary$2.run(CoreTagLibrary.java:105) at org.kohsuke.stapler.jelly.CallTagLibScript.run(CallTagLibScript.java:120) at org.apache.commons.jelly.tags.core.CoreTagLibrary$2.run(CoreTagLibrary.java:105) at org.kohsuke.stapler.jelly.JellyViewScript.run(JellyViewScript.java:95) at org.kohsuke.stapler.jelly.DefaultScriptInvoker.invokeScript(DefaultScriptInvoker.java:63) at org.kohsuke.stapler.jelly.DefaultScriptInvoker.invokeScript(DefaultScriptInvoker.java:53) at org.kohsuke.stapler.jelly.JellyFacet$1.dispatch(JellyFacet.java:103) at org.kohsuke.stapler.Stapler.tryInvoke(Stapler.java:739) at org.kohsuke.stapler.Stapler.invoke(Stapler.java:870) at org.kohsuke.stapler.MetaClass$4.doDispatch(MetaClass.java:282) at org.kohsuke.stapler.NameBasedDispatcher.dispatch(NameBasedDispatcher.java:58) at org.kohsuke.stapler.Stapler.tryInvoke(Stapler.java:739) at org.kohsuke.stapler.Stapler.invoke(Stapler.java:870) at org.kohsuke.stapler.Stapler.invoke(Stapler.java:668) at org.kohsuke.stapler.Stapler.service(Stapler.java:238) at javax.servlet.http.HttpServlet.service(HttpServlet.java:790) at org.eclipse.jetty.servlet.ServletHolder.handle(ServletHolder.java:812) at org.eclipse.jetty.servlet.ServletHandler$CachedChain.doFilter(ServletHandler.java:1669) at hudson.util.PluginServletFilter$1.doFilter(PluginServletFilter.java:154) at jenkins.telemetry.impl.UserLanguages$AcceptLanguageFilter.doFilter(UserLanguages.java:128) at hudson.util.PluginServletFilter$1.doFilter(PluginServletFilter.java:151) at hudson.util.PluginServletFilter.doFilter(PluginServletFilter.java:157) at org.eclipse.jetty.servlet.ServletHandler$CachedChain.doFilter(ServletHandler.java:1652) at hudson.security.csrf.CrumbFilter.doFilter(CrumbFilter.java:105) at org.eclipse.jetty.servlet.ServletHandler$CachedChain.doFilter(ServletHandler.java:1652) at hudson.security.ChainedServletFilter$1.doFilter(ChainedServletFilter.java:84) at hudson.security.ChainedServletFilter.doFilter(ChainedServletFilter.java:90) at hudson.security.HudsonFilter.doFilter(HudsonFilter.java:171) at org.eclipse.jetty.servlet.ServletHandler$CachedChain.doFilter(ServletHandler.java:1652) at org.kohsuke.stapler.compression.CompressionFilter.doFilter(CompressionFilter.java:49) at org.eclipse.jetty.servlet.ServletHandler$CachedChain.doFilter(ServletHandler.java:1652) at hudson.util.CharacterEncodingFilter.doFilter(CharacterEncodingFilter.java:82) at org.eclipse.jetty.servlet.ServletHandler$CachedChain.doFilter(ServletHandler.java:1652) at org.kohsuke.stapler.DiagnosticThreadNameFilter.doFilter(DiagnosticThreadNameFilter.java:30) at org.eclipse.jetty.servlet.ServletHandler$CachedChain.doFilter(ServletHandler.java:1652) at org.eclipse.jetty.servlet.ServletHandler.doHandle(ServletHandler.java:585) at org.eclipse.jetty.server.handler.ScopedHandler.handle(ScopedHandler.java:143) at org.eclipse.jetty.security.SecurityHandler.handle(SecurityHandler.java:553) at org.eclipse.jetty.server.session.SessionHandler.doHandle(SessionHandler.java:223) at org.eclipse.jetty.server.handler.ContextHandler.doHandle(ContextHandler.java:1127) at org.eclipse.jetty.servlet.ServletHandler.doScope(ServletHandler.java:515) at org.eclipse.jetty.server.session.SessionHandler.doScope(SessionHandler.java:185) at org.eclipse.jetty.server.handler.ContextHandler.doScope(ContextHandler.java:1061) at org.eclipse.jetty.server.handler.ScopedHandler.handle(ScopedHandler.java:141) at org.eclipse.jetty.server.handler.HandlerWrapper.handle(HandlerWrapper.java:97) at org.eclipse.jetty.server.Server.handle(Server.java:499) at org.eclipse.jetty.server.HttpChannel.handle(HttpChannel.java:311) at org.eclipse.jetty.server.HttpConnection.onFillable(HttpConnection.java:257) at org.eclipse.jetty.io.AbstractConnection$2.run(AbstractConnection.java:544) at java.util.concurrent.Executors$RunnableAdapter.call(Executors.java:511) at java.util.concurrent.FutureTask.run(FutureTask.java:266) at java.util.concurrent.ThreadPoolExecutor.runWorker(ThreadPoolExecutor.java:1142) at java.util.concurrent.ThreadPoolExecutor$Worker.run(ThreadPoolExecutor.java:617) at java.lang.Thread.run(Thread.java:745) Caused by: java.security.KeyStoreException: JENKINS-41987: no X509Certificate found; perhaps instance-identity module is missing or too old at jenkins.slaves.JnlpSlaveAgentProtocol4.<init>(JnlpSlaveAgentProtocol4.java:107) at jenkins.slaves.JnlpSlaveAgentProtocol4$$FastClassByGuice$$b470638c.newInstance(<generated>) at com.google.inject.internal.cglib.reflect.$FastConstructor.newInstance(FastConstructor.java:40) at com.google.inject.internal.DefaultConstructionProxyFactory$1.newInstance(DefaultConstructionProxyFactory.java:61) at com.google.inject.internal.ConstructorInjector.provision(ConstructorInjector.java:105) at com.google.inject.internal.ConstructorInjector.access$000(ConstructorInjector.java:32) at com.google.inject.internal.ConstructorInjector$1.call(ConstructorInjector.java:89) at com.google.inject.internal.ProvisionListenerStackCallback$Provision.provision(ProvisionListenerStackCallback.java:115) at hudson.ExtensionFinder$GuiceFinder$SezpozModule.onProvision(ExtensionFinder.java:567) at com.google.inject.internal.ProvisionListenerStackCallback$Provision.provision(ProvisionListenerStackCallback.java:126) at com.google.inject.internal.ProvisionListenerStackCallback.provision(ProvisionListenerStackCallback.java:68) at com.google.inject.internal.ConstructorInjector.construct(ConstructorInjector.java:87) at com.google.inject.internal.ConstructorBindingImpl$Factory.get(ConstructorBindingImpl.java:267) at com.google.inject.internal.ProviderToInternalFactoryAdapter$1.call(ProviderToInternalFactoryAdapter.java:46) at com.google.inject.internal.InjectorImpl.callInContext(InjectorImpl.java:1103) at com.google.inject.internal.ProviderToInternalFactoryAdapter.get(ProviderToInternalFactoryAdapter.java:40) ... 114 more Dec 10, 2018 11:12:42 AM com.gargoylesoftware.htmlunit.javascript.host.css.CSSStyleSheet isValidSelector WARNING: Unhandled CSS condition type '7'. Accepting it silently. Dec 10, 2018 11:12:42 AM com.gargoylesoftware.htmlunit.javascript.StrictErrorReporter runtimeError SEVERE: runtimeError: message=[An invalid or illegal selector was specified (selector: '*,:x' error: Invalid selector: *:x).] sourceName=[http://localhost:52540/jenkins/static/fb09fb28/assets/jquery-detached/jsmodules/jquery2.js] line=[996] lineSource=[null] lineOffset=[0] Dec 10, 2018 11:12:42 AM com.gargoylesoftware.htmlunit.javascript.host.css.CSSStyleSheet isValidSelector WARNING: Unhandled CSS condition type '7'. Accepting it silently. Dec 10, 2018 11:12:42 AM com.gargoylesoftware.htmlunit.javascript.StrictErrorReporter runtimeError SEVERE: runtimeError: message=[An invalid or illegal selector was specified (selector: '*,:x' error: Invalid selector: *:x).] sourceName=[http://localhost:52540/jenkins/static/fb09fb28/assets/jquery-detached/jsmodules/jquery2.js] line=[996] lineSource=[null] lineOffset=[0] Dec 10, 2018 11:12:42 AM com.gargoylesoftware.htmlunit.javascript.StrictErrorReporter runtimeError SEVERE: runtimeError: message=[An invalid or illegal selector was specified (selector: '[id='sizzle1544436762749'] :input.block-control' error: Invalid selector: *[id="sizzle1544436762749"] *:input.block-control).] sourceName=[http://localhost:52540/jenkins/static/fb09fb28/assets/jquery-detached/jsmodules/jquery2.js] line=[996] lineSource=[null] lineOffset=[0] Dec 10, 2018 11:12:42 AM com.gargoylesoftware.htmlunit.javascript.StrictErrorReporter runtimeError SEVERE: runtimeError: message=[An invalid or illegal selector was specified (selector: '[id='sizzle1544436762749'] :input.block-control' error: Invalid selector: *[id="sizzle1544436762749"] *:input.block-control).] sourceName=[http://localhost:52540/jenkins/static/fb09fb28/assets/jquery-detached/jsmodules/jquery2.js] line=[996] lineSource=[null] lineOffset=[0] Dec 10, 2018 11:12:42 AM com.gargoylesoftware.htmlunit.javascript.StrictErrorReporter runtimeError SEVERE: runtimeError: message=[An invalid or illegal selector was specified (selector: '[id='sizzle1544436762749'] :input.block-control' error: Invalid selector: *[id="sizzle1544436762749"] *:input.block-control).] sourceName=[http://localhost:52540/jenkins/static/fb09fb28/assets/jquery-detached/jsmodules/jquery2.js] line=[996] lineSource=[null] lineOffset=[0] Dec 10, 2018 11:12:42 AM com.gargoylesoftware.htmlunit.javascript.StrictErrorReporter runtimeError SEVERE: runtimeError: message=[An invalid or illegal selector was specified (selector: '[id='sizzle1544436762749'] :input.block-control' error: Invalid selector: *[id="sizzle1544436762749"] *:input.block-control).] sourceName=[http://localhost:52540/jenkins/static/fb09fb28/assets/jquery-detached/jsmodules/jquery2.js] line=[996] lineSource=[null] lineOffset=[0] Dec 10, 2018 11:12:42 AM com.gargoylesoftware.htmlunit.javascript.StrictErrorReporter runtimeError SEVERE: runtimeError: message=[An invalid or illegal selector was specified (selector: '[id='sizzle1544436762749'] :input.block-control' error: Invalid selector: *[id="sizzle1544436762749"] *:input.block-control).] sourceName=[http://localhost:52540/jenkins/static/fb09fb28/assets/jquery-detached/jsmodules/jquery2.js] line=[996] lineSource=[null] lineOffset=[0] Dec 10, 2018 11:12:42 AM com.gargoylesoftware.htmlunit.javascript.StrictErrorReporter runtimeError SEVERE: runtimeError: message=[An invalid or illegal selector was specified (selector: '[id='sizzle1544436762749'] :input.block-control' error: Invalid selector: *[id="sizzle1544436762749"] *:input.block-control).] sourceName=[http://localhost:52540/jenkins/static/fb09fb28/assets/jquery-detached/jsmodules/jquery2.js] line=[996] lineSource=[null] lineOffset=[0] Dec 10, 2018 11:12:42 AM com.gargoylesoftware.htmlunit.javascript.StrictErrorReporter runtimeError SEVERE: runtimeError: message=[An invalid or illegal selector was specified (selector: '[id='sizzle1544436762749'] :input.block-control' error: Invalid selector: *[id="sizzle1544436762749"] *:input.block-control).] sourceName=[http://localhost:52540/jenkins/static/fb09fb28/assets/jquery-detached/jsmodules/jquery2.js] line=[996] lineSource=[null] lineOffset=[0] Dec 10, 2018 11:12:42 AM com.gargoylesoftware.htmlunit.javascript.StrictErrorReporter runtimeError SEVERE: runtimeError: message=[An invalid or illegal selector was specified (selector: '[id='sizzle1544436762749'] :input.block-control' error: Invalid selector: *[id="sizzle1544436762749"] *:input.block-control).] sourceName=[http://localhost:52540/jenkins/static/fb09fb28/assets/jquery-detached/jsmodules/jquery2.js] line=[996] lineSource=[null] lineOffset=[0] Dec 10, 2018 11:12:42 AM com.gargoylesoftware.htmlunit.javascript.StrictErrorReporter runtimeError SEVERE: runtimeError: message=[An invalid or illegal selector was specified (selector: '[id='sizzle1544436762749'] :input.block-control' error: Invalid selector: *[id="sizzle1544436762749"] *:input.block-control).] sourceName=[http://localhost:52540/jenkins/static/fb09fb28/assets/jquery-detached/jsmodules/jquery2.js] line=[996] lineSource=[null] lineOffset=[0] Dec 10, 2018 11:12:42 AM com.gargoylesoftware.htmlunit.javascript.StrictErrorReporter runtimeError SEVERE: runtimeError: message=[An invalid or illegal selector was specified (selector: '[id='sizzle1544436762749'] :input.block-control' error: Invalid selector: *[id="sizzle1544436762749"] *:input.block-control).] sourceName=[http://localhost:52540/jenkins/static/fb09fb28/assets/jquery-detached/jsmodules/jquery2.js] line=[996] lineSource=[null] lineOffset=[0] Dec 10, 2018 11:12:42 AM com.gargoylesoftware.htmlunit.javascript.StrictErrorReporter runtimeError SEVERE: runtimeError: message=[An invalid or illegal selector was specified (selector: '[id='sizzle1544436762749'] :input.block-control' error: Invalid selector: *[id="sizzle1544436762749"] *:input.block-control).] sourceName=[http://localhost:52540/jenkins/static/fb09fb28/assets/jquery-detached/jsmodules/jquery2.js] line=[996] lineSource=[null] lineOffset=[0] Dec 10, 2018 11:12:42 AM com.gargoylesoftware.htmlunit.javascript.StrictErrorReporter runtimeError SEVERE: runtimeError: message=[An invalid or illegal selector was specified (selector: '[id='sizzle1544436762749'] :input.block-control' error: Invalid selector: *[id="sizzle1544436762749"] *:input.block-control).] sourceName=[http://localhost:52540/jenkins/static/fb09fb28/assets/jquery-detached/jsmodules/jquery2.js] line=[996] lineSource=[null] lineOffset=[0] Dec 10, 2018 11:12:42 AM com.gargoylesoftware.htmlunit.javascript.StrictErrorReporter runtimeError SEVERE: runtimeError: message=[An invalid or illegal selector was specified (selector: '[id='sizzle1544436762749'] :input.block-control' error: Invalid selector: *[id="sizzle1544436762749"] *:input.block-control).] sourceName=[http://localhost:52540/jenkins/static/fb09fb28/assets/jquery-detached/jsmodules/jquery2.js] line=[996] lineSource=[null] lineOffset=[0] Dec 10, 2018 11:12:42 AM com.gargoylesoftware.htmlunit.javascript.StrictErrorReporter runtimeError SEVERE: runtimeError: message=[An invalid or illegal selector was specified (selector: '[id='sizzle1544436762749'] :input.block-control' error: Invalid selector: *[id="sizzle1544436762749"] *:input.block-control).] sourceName=[http://localhost:52540/jenkins/static/fb09fb28/assets/jquery-detached/jsmodules/jquery2.js] line=[996] lineSource=[null] lineOffset=[0] Dec 10, 2018 11:12:54 AM com.gargoylesoftware.htmlunit.javascript.host.css.CSSStyleSheet isValidSelector WARNING: Unhandled CSS condition type '7'. Accepting it silently. Dec 10, 2018 11:12:54 AM com.gargoylesoftware.htmlunit.javascript.StrictErrorReporter runtimeError SEVERE: runtimeError: message=[An invalid or illegal selector was specified (selector: '*,:x' error: Invalid selector: *:x).] sourceName=[http://localhost:52540/jenkins/static/fb09fb28/assets/jquery-detached/jsmodules/jquery2.js] line=[996] lineSource=[null] lineOffset=[0] Dec 10, 2018 11:12:54 AM jenkins.model.Jenkins cleanUp INFO: Stopping Jenkins WARN: The method class org.apache.commons.logging.impl.SLF4JLogFactory#release() was invoked. WARN: Please see http://www.slf4j.org/codes.html#release for an explanation. Dec 10, 2018 11:12:54 AM jenkins.model.Jenkins cleanUp INFO: Jenkins stopped [ERROR] Tests run: 12, Failures: 5, Errors: 0, Skipped: 0, Time elapsed: 165.428 s <<< FAILURE! - in hudson.tasks.MailerTest [ERROR] testHudsonUrlCompatibility(hudson.tasks.MailerTest)  Time elapsed: 16.602 s  <<< FAILURE! java.lang.AssertionError: expected:<http://localhost:52480/jenkins/> but was:<null> at org.junit.Assert.fail(Assert.java:88) at org.junit.Assert.failNotEquals(Assert.java:834) at org.junit.Assert.assertEquals(Assert.java:118) at org.junit.Assert.assertEquals(Assert.java:144) at hudson.tasks.MailerTest.testHudsonUrlCompatibility(MailerTest.java:182) at sun.reflect.NativeMethodAccessorImpl.invoke0(Native Method) at sun.reflect.NativeMethodAccessorImpl.invoke(NativeMethodAccessorImpl.java:62) at sun.reflect.DelegatingMethodAccessorImpl.invoke(DelegatingMethodAccessorImpl.java:43) at java.lang.reflect.Method.invoke(Method.java:498) at org.junit.runners.model.FrameworkMethod$1.runReflectiveCall(FrameworkMethod.java:50) at org.junit.internal.runners.model.ReflectiveCallable.run(ReflectiveCallable.java:12) at org.junit.runners.model.FrameworkMethod.invokeExplosively(FrameworkMethod.java:47) at org.junit.internal.runners.statements.InvokeMethod.evaluate(InvokeMethod.java:17) at org.jvnet.hudson.test.JenkinsRule$2.evaluate(JenkinsRule.java:550) at org.junit.rules.RunRules.evaluate(RunRules.java:20) at org.junit.runners.ParentRunner.runLeaf(ParentRunner.java:325) at org.junit.runners.BlockJUnit4ClassRunner.runChild(BlockJUnit4ClassRunner.java:78) at org.junit.runners.BlockJUnit4ClassRunner.runChild(BlockJUnit4ClassRunner.java:57) at org.junit.runners.ParentRunner$3.run(ParentRunner.java:290) at org.junit.runners.ParentRunner$1.schedule(ParentRunner.java:71) at org.junit.runners.ParentRunner.runChildren(ParentRunner.java:288) at org.junit.runners.ParentRunner.access$000(ParentRunner.java:58) at org.junit.runners.ParentRunner$2.evaluate(ParentRunner.java:268) at org.junit.runners.ParentRunner.run(ParentRunner.java:363) at org.apache.maven.surefire.junit4.JUnit4Provider.execute(JUnit4Provider.java:365) at org.apache.maven.surefire.junit4.JUnit4Provider.executeWithRerun(JUnit4Provider.java:272) at org.apache.maven.surefire.junit4.JUnit4Provider.executeTestSet(JUnit4Provider.java:236) at org.apache.maven.surefire.junit4.JUnit4Provider.invoke(JUnit4Provider.java:159) at org.apache.maven.surefire.booter.ForkedBooter.invokeProviderInSameClassLoader(ForkedBooter.java:386) at org.apache.maven.surefire.booter.ForkedBooter.runSuitesInProcess(ForkedBooter.java:323) at org.apache.maven.surefire.booter.ForkedBooter.main(ForkedBooter.java:143) [ERROR] testHudsonUrlCompatibility(hudson.tasks.MailerTest)  Time elapsed: 15.157 s  <<< FAILURE! java.lang.AssertionError: expected:<http://localhost:52503/jenkins/> but was:<null> at org.junit.Assert.fail(Assert.java:88) at org.junit.Assert.failNotEquals(Assert.java:834) at org.junit.Assert.assertEquals(Assert.java:118) at org.junit.Assert.assertEquals(Assert.java:144) at hudson.tasks.MailerTest.testHudsonUrlCompatibility(MailerTest.java:182) at sun.reflect.NativeMethodAccessorImpl.invoke0(Native Method) at sun.reflect.NativeMethodAccessorImpl.invoke(NativeMethodAccessorImpl.java:62) at sun.reflect.DelegatingMethodAccessorImpl.invoke(DelegatingMethodAccessorImpl.java:43) at java.lang.reflect.Method.invoke(Method.java:498) at org.junit.runners.model.FrameworkMethod$1.runReflectiveCall(FrameworkMethod.java:50) at org.junit.internal.runners.model.ReflectiveCallable.run(ReflectiveCallable.java:12) at org.junit.runners.model.FrameworkMethod.invokeExplosively(FrameworkMethod.java:47) at org.junit.internal.runners.statements.InvokeMethod.evaluate(InvokeMethod.java:17) at org.jvnet.hudson.test.JenkinsRule$2.evaluate(JenkinsRule.java:550) at org.junit.rules.RunRules.evaluate(RunRules.java:20) at org.junit.runners.ParentRunner.runLeaf(ParentRunner.java:325) at org.junit.runners.BlockJUnit4ClassRunner.runChild(BlockJUnit4ClassRunner.java:78) at org.junit.runners.BlockJUnit4ClassRunner.runChild(BlockJUnit4ClassRunner.java:57) at org.junit.runners.ParentRunner$3.run(ParentRunner.java:290) at org.junit.runners.ParentRunner$1.schedule(ParentRunner.java:71) at org.junit.runners.ParentRunner.runChildren(ParentRunner.java:288) at org.junit.runners.ParentRunner.access$000(ParentRunner.java:58) at org.junit.runners.ParentRunner$2.evaluate(ParentRunner.java:268) at org.junit.runners.ParentRunner.run(ParentRunner.java:363) at org.apache.maven.surefire.junit4.JUnit4Provider.executeFailedMethod(JUnit4Provider.java:379) at org.apache.maven.surefire.junit4.JUnit4Provider.executeWithRerun(JUnit4Provider.java:290) at org.apache.maven.surefire.junit4.JUnit4Provider.executeTestSet(JUnit4Provider.java:236) at org.apache.maven.surefire.junit4.JUnit4Provider.invoke(JUnit4Provider.java:159) at org.apache.maven.surefire.booter.ForkedBooter.invokeProviderInSameClassLoader(ForkedBooter.java:386) at org.apache.maven.surefire.booter.ForkedBooter.runSuitesInProcess(ForkedBooter.java:323) at org.apache.maven.surefire.booter.ForkedBooter.main(ForkedBooter.java:143) [ERROR] testHudsonUrlCompatibility(hudson.tasks.MailerTest)  Time elapsed: 14.979 s  <<< FAILURE! java.lang.AssertionError: expected:<http://localhost:52516/jenkins/> but was:<null> at org.junit.Assert.fail(Assert.java:88) at org.junit.Assert.failNotEquals(Assert.java:834) at org.junit.Assert.assertEquals(Assert.java:118) at org.junit.Assert.assertEquals(Assert.java:144) at hudson.tasks.MailerTest.testHudsonUrlCompatibility(MailerTest.java:182) at sun.reflect.NativeMethodAccessorImpl.invoke0(Native Method) at sun.reflect.NativeMethodAccessorImpl.invoke(NativeMethodAccessorImpl.java:62) at sun.reflect.DelegatingMethodAccessorImpl.invoke(DelegatingMethodAccessorImpl.java:43) at java.lang.reflect.Method.invoke(Method.java:498) at org.junit.runners.model.FrameworkMethod$1.runReflectiveCall(FrameworkMethod.java:50) at org.junit.internal.runners.model.ReflectiveCallable.run(ReflectiveCallable.java:12) at org.junit.runners.model.FrameworkMethod.invokeExplosively(FrameworkMethod.java:47) at org.junit.internal.runners.statements.InvokeMethod.evaluate(InvokeMethod.java:17) at org.jvnet.hudson.test.JenkinsRule$2.evaluate(JenkinsRule.java:550) at org.junit.rules.RunRules.evaluate(RunRules.java:20) at org.junit.runners.ParentRunner.runLeaf(ParentRunner.java:325) at org.junit.runners.BlockJUnit4ClassRunner.runChild(BlockJUnit4ClassRunner.java:78) at org.junit.runners.BlockJUnit4ClassRunner.runChild(BlockJUnit4ClassRunner.java:57) at org.junit.runners.ParentRunner$3.run(ParentRunner.java:290) at org.junit.runners.ParentRunner$1.schedule(ParentRunner.java:71) at org.junit.runners.ParentRunner.runChildren(ParentRunner.java:288) at org.junit.runners.ParentRunner.access$000(ParentRunner.java:58) at org.junit.runners.ParentRunner$2.evaluate(ParentRunner.java:268) at org.junit.runners.ParentRunner.run(ParentRunner.java:363) at org.apache.maven.surefire.junit4.JUnit4Provider.executeFailedMethod(JUnit4Provider.java:379) at org.apache.maven.surefire.junit4.JUnit4Provider.executeWithRerun(JUnit4Provider.java:290) at org.apache.maven.surefire.junit4.JUnit4Provider.executeTestSet(JUnit4Provider.java:236) at org.apache.maven.surefire.junit4.JUnit4Provider.invoke(JUnit4Provider.java:159) at org.apache.maven.surefire.booter.ForkedBooter.invokeProviderInSameClassLoader(ForkedBooter.java:386) at org.apache.maven.surefire.booter.ForkedBooter.runSuitesInProcess(ForkedBooter.java:323) at org.apache.maven.surefire.booter.ForkedBooter.main(ForkedBooter.java:143) [ERROR] testHudsonUrlCompatibility(hudson.tasks.MailerTest)  Time elapsed: 15.963 s  <<< FAILURE! java.lang.AssertionError: expected:<http://localhost:52520/jenkins/> but was:<null> at org.junit.Assert.fail(Assert.java:88) at org.junit.Assert.failNotEquals(Assert.java:834) at org.junit.Assert.assertEquals(Assert.java:118) at org.junit.Assert.assertEquals(Assert.java:144) at hudson.tasks.MailerTest.testHudsonUrlCompatibility(MailerTest.java:182) at sun.reflect.NativeMethodAccessorImpl.invoke0(Native Method) at sun.reflect.NativeMethodAccessorImpl.invoke(NativeMethodAccessorImpl.java:62) at sun.reflect.DelegatingMethodAccessorImpl.invoke(DelegatingMethodAccessorImpl.java:43) at java.lang.reflect.Method.invoke(Method.java:498) at org.junit.runners.model.FrameworkMethod$1.runReflectiveCall(FrameworkMethod.java:50) at org.junit.internal.runners.model.ReflectiveCallable.run(ReflectiveCallable.java:12) at org.junit.runners.model.FrameworkMethod.invokeExplosively(FrameworkMethod.java:47) at org.junit.internal.runners.statements.InvokeMethod.evaluate(InvokeMethod.java:17) at org.jvnet.hudson.test.JenkinsRule$2.evaluate(JenkinsRule.java:550) at org.junit.rules.RunRules.evaluate(RunRules.java:20) at org.junit.runners.ParentRunner.runLeaf(ParentRunner.java:325) at org.junit.runners.BlockJUnit4ClassRunner.runChild(BlockJUnit4ClassRunner.java:78) at org.junit.runners.BlockJUnit4ClassRunner.runChild(BlockJUnit4ClassRunner.java:57) at org.junit.runners.ParentRunner$3.run(ParentRunner.java:290) at org.junit.runners.ParentRunner$1.schedule(ParentRunner.java:71) at org.junit.runners.ParentRunner.runChildren(ParentRunner.java:288) at org.junit.runners.ParentRunner.access$000(ParentRunner.java:58) at org.junit.runners.ParentRunner$2.evaluate(ParentRunner.java:268) at org.junit.runners.ParentRunner.run(ParentRunner.java:363) at org.apache.maven.surefire.junit4.JUnit4Provider.executeFailedMethod(JUnit4Provider.java:379) at org.apache.maven.surefire.junit4.JUnit4Provider.executeWithRerun(JUnit4Provider.java:290) at org.apache.maven.surefire.junit4.JUnit4Provider.executeTestSet(JUnit4Provider.java:236) at org.apache.maven.surefire.junit4.JUnit4Provider.invoke(JUnit4Provider.java:159) at org.apache.maven.surefire.booter.ForkedBooter.invokeProviderInSameClassLoader(ForkedBooter.java:386) at org.apache.maven.surefire.booter.ForkedBooter.runSuitesInProcess(ForkedBooter.java:323) at org.apache.maven.surefire.booter.ForkedBooter.main(ForkedBooter.java:143) [ERROR] testHudsonUrlCompatibility(hudson.tasks.MailerTest)  Time elapsed: 15.186 s  <<< FAILURE! java.lang.AssertionError: expected:<http://localhost:52540/jenkins/> but was:<null> at org.junit.Assert.fail(Assert.java:88) at org.junit.Assert.failNotEquals(Assert.java:834) at org.junit.Assert.assertEquals(Assert.java:118) at org.junit.Assert.assertEquals(Assert.java:144) at hudson.tasks.MailerTest.testHudsonUrlCompatibility(MailerTest.java:182) at sun.reflect.NativeMethodAccessorImpl.invoke0(Native Method) at sun.reflect.NativeMethodAccessorImpl.invoke(NativeMethodAccessorImpl.java:62) at sun.reflect.DelegatingMethodAccessorImpl.invoke(DelegatingMethodAccessorImpl.java:43) at java.lang.reflect.Method.invoke(Method.java:498) at org.junit.runners.model.FrameworkMethod$1.runReflectiveCall(FrameworkMethod.java:50) at org.junit.internal.runners.model.ReflectiveCallable.run(ReflectiveCallable.java:12) at org.junit.runners.model.FrameworkMethod.invokeExplosively(FrameworkMethod.java:47) at org.junit.internal.runners.statements.InvokeMethod.evaluate(InvokeMethod.java:17) at org.jvnet.hudson.test.JenkinsRule$2.evaluate(JenkinsRule.java:550) at org.junit.rules.RunRules.evaluate(RunRules.java:20) at org.junit.runners.ParentRunner.runLeaf(ParentRunner.java:325) at org.junit.runners.BlockJUnit4ClassRunner.runChild(BlockJUnit4ClassRunner.java:78) at org.junit.runners.BlockJUnit4ClassRunner.runChild(BlockJUnit4ClassRunner.java:57) at org.junit.runners.ParentRunner$3.run(ParentRunner.java:290) at org.junit.runners.ParentRunner$1.schedule(ParentRunner.java:71) at org.junit.runners.ParentRunner.runChildren(ParentRunner.java:288) at org.junit.runners.ParentRunner.access$000(ParentRunner.java:58) at org.junit.runners.ParentRunner$2.evaluate(ParentRunner.java:268) at org.junit.runners.ParentRunner.run(ParentRunner.java:363) at org.apache.maven.surefire.junit4.JUnit4Provider.executeFailedMethod(JUnit4Provider.java:379) at org.apache.maven.surefire.junit4.JUnit4Provider.executeWithRerun(JUnit4Provider.java:290) at org.apache.maven.surefire.junit4.JUnit4Provider.executeTestSet(JUnit4Provider.java:236) at org.apache.maven.surefire.junit4.JUnit4Provider.invoke(JUnit4Provider.java:159) at org.apache.maven.surefire.booter.ForkedBooter.invokeProviderInSameClassLoader(ForkedBooter.java:386) at org.apache.maven.surefire.booter.ForkedBooter.runSuitesInProcess(ForkedBooter.java:323) at org.apache.maven.surefire.booter.ForkedBooter.main(ForkedBooter.java:143)
      

        Attachments

          Activity

          Hide
          oleg_nenashev Oleg Nenashev added a comment -

          https://github.com/jenkinsci/mailer-plugin/pull/48 contributes some bits to this story

          Show
          oleg_nenashev Oleg Nenashev added a comment - https://github.com/jenkinsci/mailer-plugin/pull/48  contributes some bits to this story

            People

            • Assignee:
              alecharp Adrien Lecharpentier
              Reporter:
              oleg_nenashev Oleg Nenashev
            • Votes:
              0 Vote for this issue
              Watchers:
              1 Start watching this issue

              Dates

              • Created:
                Updated:
                Resolved: