Uploaded image for project: 'Jenkins'
  1. Jenkins
  2. JENKINS-55176

Variant Plugin: PCT fails when running with Java 11

    XMLWordPrintable

    Details

    • Similar Issues:
    • Released As:
      Variant Plugin 1.2

      Description

       

      [ERROR] Tests run: 6, Failures: 5, Errors: 0, Skipped: 0, Time elapsed: 11.839 s <<< FAILURE! - in org.jenkinsci.plugins.variant.VariantTest [ERROR] test(org.jenkinsci.plugins.variant.VariantTest)  Time elapsed: 0.582 s  <<< FAILURE! java.lang.AssertionError at org.junit.Assert.fail(Assert.java:86) at org.junit.Assert.assertTrue(Assert.java:41) at org.junit.Assert.assertTrue(Assert.java:52) at org.jenkinsci.plugins.variant.VariantTest.test(VariantTest.java:42) at java.base/jdk.internal.reflect.NativeMethodAccessorImpl.invoke0(Native Method) at java.base/jdk.internal.reflect.NativeMethodAccessorImpl.invoke(NativeMethodAccessorImpl.java:62) at java.base/jdk.internal.reflect.DelegatingMethodAccessorImpl.invoke(DelegatingMethodAccessorImpl.java:43) at java.base/java.lang.reflect.Method.invoke(Method.java:566) at org.junit.runners.model.FrameworkMethod$1.runReflectiveCall(FrameworkMethod.java:50) at org.junit.internal.runners.model.ReflectiveCallable.run(ReflectiveCallable.java:12) at org.junit.runners.model.FrameworkMethod.invokeExplosively(FrameworkMethod.java:47) at org.junit.internal.runners.statements.InvokeMethod.evaluate(InvokeMethod.java:17) at org.jvnet.hudson.test.JenkinsRule$2.evaluate(JenkinsRule.java:550) at org.junit.rules.RunRules.evaluate(RunRules.java:20) at org.junit.runners.ParentRunner.runLeaf(ParentRunner.java:325) at org.junit.runners.BlockJUnit4ClassRunner.runChild(BlockJUnit4ClassRunner.java:78) at org.junit.runners.BlockJUnit4ClassRunner.runChild(BlockJUnit4ClassRunner.java:57) at org.junit.runners.ParentRunner$3.run(ParentRunner.java:290) at org.junit.runners.ParentRunner$1.schedule(ParentRunner.java:71) at org.junit.runners.ParentRunner.runChildren(ParentRunner.java:288) at org.junit.runners.ParentRunner.access$000(ParentRunner.java:58) at org.junit.runners.ParentRunner$2.evaluate(ParentRunner.java:268) at org.junit.internal.runners.statements.RunBefores.evaluate(RunBefores.java:26) at org.junit.internal.runners.statements.RunAfters.evaluate(RunAfters.java:27) at org.junit.runners.ParentRunner.run(ParentRunner.java:363) at org.apache.maven.surefire.junit4.JUnit4Provider.execute(JUnit4Provider.java:365) at org.apache.maven.surefire.junit4.JUnit4Provider.executeWithRerun(JUnit4Provider.java:272) at org.apache.maven.surefire.junit4.JUnit4Provider.executeTestSet(JUnit4Provider.java:236) at org.apache.maven.surefire.junit4.JUnit4Provider.invoke(JUnit4Provider.java:159) at org.apache.maven.surefire.booter.ForkedBooter.invokeProviderInSameClassLoader(ForkedBooter.java:386) at org.apache.maven.surefire.booter.ForkedBooter.runSuitesInProcess(ForkedBooter.java:323) at org.apache.maven.surefire.booter.ForkedBooter.main(ForkedBooter.java:143)
      

        Attachments

          Activity

          Show
          oleg_nenashev Oleg Nenashev added a comment - https://github.com/jenkinsci/variant-plugin/commit/3688261cf3c030b3eed603cf96e4758f79b569ac  has not been released yes, so no wonder it fails. CC  Francisco Fernández  and  Manuel Recena Soto  
          Hide
          batmat Baptiste Mathus added a comment -

          Fix in https://github.com/jenkinsci/variant-plugin/pull/3 should be tested with PCT in source mode (to test the current tip of master)

          Show
          batmat Baptiste Mathus added a comment - Fix in https://github.com/jenkinsci/variant-plugin/pull/3 should be tested with PCT in source mode (to test the current tip of master)

            People

            • Assignee:
              Unassigned
              Reporter:
              oleg_nenashev Oleg Nenashev
            • Votes:
              0 Vote for this issue
              Watchers:
              2 Start watching this issue

              Dates

              • Created:
                Updated:
                Resolved: