Uploaded image for project: 'Jenkins'
  1. Jenkins
  2. JENKINS-55431

"Caused by: Command Close created at" error

    XMLWordPrintable

    Details

    • Type: Bug
    • Status: Open (View Workflow)
    • Priority: Major
    • Resolution: Unresolved
    • Component/s: maven-plugin
    • Labels:
      None
    • Environment:
      Jenkins 2.150.1
      Maven Pipeline Integration 3.6.5
    • Similar Issues:

      Description

      Error on the xwiki project. Source: https://ci.xwiki.org/job/XWiki/job/xwiki-rendering/job/stable-10.11.x/11/console

      [INFO] ------------------------------------------------------------------------
      [INFO] BUILD SUCCESS
      [INFO] ------------------------------------------------------------------------
      [INFO] Total time: 01:12 min
      [INFO] Finished at: 2019-01-03T20:46:18+01:00
      [INFO] ------------------------------------------------------------------------
      [INFO] [jenkins-event-spy] Generated /home/hudsonagent/jenkins_root/workspace/i_xwiki-rendering_stable-10.11.x@tmp/withMavenf59cb903/maven-spy-20190103-204505-5406669699568634847228.log
      [Pipeline] }
      [Pipeline] // timeout
      [Pipeline] }
      ERROR: [withMaven] WARNING Exception processing the logs generated by the Jenkins Maven Event Spy /home/hudsonagent/jenkins_root/workspace/i_xwiki-rendering_stable-10.11.x@tmp/withMavenafa95463/maven-spy-20190103-201642-6977753462139575768216.log, ignore file.  Please report a bug associated for the component 'pipeline-maven-plugin' at https://issues.jenkins-ci.org 
      hudson.remoting.ChannelClosedException: Channel "unknown": Remote call on agent-2-3 failed. The channel is closing down or has closed down
      	at hudson.remoting.Channel.call(Channel.java:948)
      	at hudson.FilePath.act(FilePath.java:1072)
      	at hudson.FilePath.act(FilePath.java:1061)
      	at hudson.FilePath.exists(FilePath.java:1581)
      	at org.jenkinsci.plugins.pipeline.maven.MavenSpyLogProcessor.processMavenSpyLogs(MavenSpyLogProcessor.java:115)
      	at org.jenkinsci.plugins.pipeline.maven.WithMavenStepExecution2$WithMavenStepExecutionCallBack.finished(WithMavenStepExecution2.java:1073)
      	at org.jenkinsci.plugins.pipeline.maven.fix.jenkins49337.GeneralNonBlockingStepExecution$TailCall.lambda$onSuccess$0(GeneralNonBlockingStepExecution.java:142)
      	at org.jenkinsci.plugins.pipeline.maven.fix.jenkins49337.GeneralNonBlockingStepExecution.lambda$run$0(GeneralNonBlockingStepExecution.java:85)
      	at java.util.concurrent.Executors$RunnableAdapter.call(Executors.java:511)
      	at java.util.concurrent.FutureTask.run(FutureTask.java:266)
      	at java.util.concurrent.ThreadPoolExecutor.runWorker(ThreadPoolExecutor.java:1149)
      	at java.util.concurrent.ThreadPoolExecutor$Worker.run(ThreadPoolExecutor.java:624)
      	at java.lang.Thread.run(Thread.java:748)
      Caused by: hudson.remoting.Channel$OrderlyShutdown: Command Close created at
      	at hudson.remoting.Channel$CloseCommand.execute(Channel.java:1271)
      	at hudson.remoting.Channel$1.handle(Channel.java:565)
      	at hudson.remoting.SynchronousCommandTransport$ReaderThread.run(SynchronousCommandTransport.java:85)
      Caused by: Command Close created at
      	at hudson.remoting.Command.<init>(Command.java:68)
      	at hudson.remoting.Channel$CloseCommand.<init>(Channel.java:1265)
      	at hudson.remoting.Channel$CloseCommand.<init>(Channel.java:1263)
      	at hudson.remoting.Channel.close(Channel.java:1436)
      	at hudson.remoting.Channel.close(Channel.java:1403)
      	at hudson.remoting.Channel$CloseCommand.execute(Channel.java:1270)
      	... 2 more
      [withMaven] Publishers: Pipeline Graph Publisher: 1508176 ms
      ERROR: [withMaven] WARNING Exception processing the logs generated by the Jenkins Maven Event Spy /home/hudsonagent/jenkins_root/workspace/i_xwiki-rendering_stable-10.11.x@tmp/withMavenafa95463/maven-spy-20190103-201816-5808071330476433673057.log, ignore file.  Please report a bug associated for the component 'pipeline-maven-plugin' at https://issues.jenkins-ci.org 
      java.io.IOException: remote file operation failed
      	at hudson.FilePath.actAsync(FilePath.java:1151)
      	at hudson.FilePath.read(FilePath.java:1981)
      	at org.jenkinsci.plugins.pipeline.maven.MavenSpyLogProcessor.processMavenSpyLogs(MavenSpyLogProcessor.java:92)
      	at org.jenkinsci.plugins.pipeline.maven.WithMavenStepExecution2$WithMavenStepExecutionCallBack.finished(WithMavenStepExecution2.java:1073)
      	at org.jenkinsci.plugins.pipeline.maven.fix.jenkins49337.GeneralNonBlockingStepExecution$TailCall.lambda$onSuccess$0(GeneralNonBlockingStepExecution.java:142)
      	at org.jenkinsci.plugins.pipeline.maven.fix.jenkins49337.GeneralNonBlockingStepExecution.lambda$run$0(GeneralNonBlockingStepExecution.java:85)
      	at java.util.concurrent.Executors$RunnableAdapter.call(Executors.java:511)
      	at java.util.concurrent.FutureTask.run(FutureTask.java:266)
      	at java.util.concurrent.ThreadPoolExecutor.runWorker(ThreadPoolExecutor.java:1149)
      	at java.util.concurrent.ThreadPoolExecutor$Worker.run(ThreadPoolExecutor.java:624)
      	at java.lang.Thread.run(Thread.java:748)
      Caused by: hudson.remoting.ChannelClosedException: Channel "unknown": Remote call on agent-2-3 failed. The channel is closing down or has closed down
      	at hudson.remoting.Channel.callAsync(Channel.java:982)
      	at hudson.FilePath.actAsync(FilePath.java:1148)
      	... 10 more
      Caused by: hudson.remoting.Channel$OrderlyShutdown: Command Close created at
      	at hudson.remoting.Channel$CloseCommand.execute(Channel.java:1271)
      	at hudson.remoting.Channel$1.handle(Channel.java:565)
      	at hudson.remoting.SynchronousCommandTransport$ReaderThread.run(SynchronousCommandTransport.java:85)
      Caused by: Command Close created at
      	at hudson.remoting.Command.<init>(Command.java:68)
      	at hudson.remoting.Channel$CloseCommand.<init>(Channel.java:1265)
      	at hudson.remoting.Channel$CloseCommand.<init>(Channel.java:1263)
      	at hudson.remoting.Channel.close(Channel.java:1436)
      	at hudson.remoting.Channel.close(Channel.java:1403)
      	at hudson.remoting.Channel$CloseCommand.execute(Channel.java:1270)
      	... 2 more
      [withMaven] Publishers: 
      [Pipeline] // withMaven
      [Pipeline] }
      [Pipeline] // stage
      [Pipeline] }
      [Pipeline] // node
      [Pipeline] }
      Failed in branch quality
      [withMaven] Jenkins Task Scanner Plugin not found, don't display results of source code scanning for 'TODO' and 'FIXME' in pipeline screen.
      [withMaven] Publishers: Pipeline Graph Publisher: 149233 ms, Invoker Publisher: 11 ms, Junit Publisher: 22 ms, Concordion Publisher: 18 ms, Findbugs Publisher: 4 ms, JGiven Publisher: 25 ms, Jacoco Publisher: 4 ms, SpotBugs Publisher: 4 ms, Open Task Scanner Publisher: 9 ms
      [Pipeline] // withMaven
      [Pipeline] }
      [Pipeline] // stage
      [Pipeline] stage
      [Pipeline] { (Post Build for Checkstyle)
      [Pipeline] echo
      ➡ Current build status after withMaven execution: SUCCESS
      [Pipeline] }
      [Pipeline] // stage
      [Pipeline] }
      [Pipeline] // node
      [Pipeline] }
      [Pipeline] // parallel
      [Pipeline] }
      [Pipeline] // stage
      [Pipeline] End of Pipeline
      
      GitHub has been notified of this commit’s build result
      
      Command Close created at
      	at hudson.remoting.Command.<init>(Command.java:68)
      	at hudson.remoting.Channel$CloseCommand.<init>(Channel.java:1265)
      	at hudson.remoting.Channel$CloseCommand.<init>(Channel.java:1263)
      	at hudson.remoting.Channel.close(Channel.java:1436)
      	at hudson.remoting.Channel.close(Channel.java:1403)
      	at hudson.remoting.Channel$CloseCommand.execute(Channel.java:1270)
      Caused: hudson.remoting.Channel$OrderlyShutdown
      	at hudson.remoting.Channel$CloseCommand.execute(Channel.java:1271)
      	at hudson.remoting.Channel$1.handle(Channel.java:565)
      	at hudson.remoting.SynchronousCommandTransport$ReaderThread.run(SynchronousCommandTransport.java:85)
      Caused: hudson.remoting.ChannelClosedException: Channel "unknown": Remote call on agent-2-3 failed. The channel is closing down or has closed down
      	at hudson.remoting.Channel.call(Channel.java:948)
      	at hudson.FilePath.act(FilePath.java:1072)
      	at hudson.FilePath.act(FilePath.java:1061)
      	at hudson.FilePath.list(FilePath.java:1922)
      	at hudson.FilePath.list(FilePath.java:1906)
      	at hudson.FilePath.list(FilePath.java:1891)
      	at org.jenkinsci.plugins.pipeline.maven.MavenSpyLogProcessor.processMavenSpyLogs(MavenSpyLogProcessor.java:173)
      	at org.jenkinsci.plugins.pipeline.maven.WithMavenStepExecution2$WithMavenStepExecutionCallBack.finished(WithMavenStepExecution2.java:1073)
      	at org.jenkinsci.plugins.pipeline.maven.fix.jenkins49337.GeneralNonBlockingStepExecution$TailCall.lambda$onSuccess$0(GeneralNonBlockingStepExecution.java:142)
      	at org.jenkinsci.plugins.pipeline.maven.fix.jenkins49337.GeneralNonBlockingStepExecution.lambda$run$0(GeneralNonBlockingStepExecution.java:85)
      	at java.util.concurrent.Executors$RunnableAdapter.call(Executors.java:511)
      	at java.util.concurrent.FutureTask.run(FutureTask.java:266)
      	at java.util.concurrent.ThreadPoolExecutor.runWorker(ThreadPoolExecutor.java:1149)
      	at java.util.concurrent.ThreadPoolExecutor$Worker.run(ThreadPoolExecutor.java:624)
      	at java.lang.Thread.run(Thread.java:748)
      Finished: FAILURE
      

        Attachments

          Activity

          There are no comments yet on this issue.

            People

            • Assignee:
              Unassigned
              Reporter:
              vmassol Vincent Massol
            • Votes:
              0 Vote for this issue
              Watchers:
              1 Start watching this issue

              Dates

              • Created:
                Updated: