Uploaded image for project: 'Jenkins'
  1. Jenkins
  2. JENKINS-26386

test Link plugin in3.10 with Jenkin 1.588 and testlink 1.9(customized) throwing error-

    XMLWordPrintable

    Details

    • Type: Bug
    • Status: Open (View Workflow)
    • Priority: Major
    • Resolution: Unresolved
    • Component/s: testlink-plugin
    • Labels:
    • Environment:
      windows 7 prof -OS
      jenkin 1.588
      testlink plugin 3.10
      testlink-java-api-1.9.7-0
      chrome browser
    • Similar Issues:

      Description

      please help me to fix this error in jenkin -testlink Continuous integration
      ---------------------
      Running MevanProject.CI.TestClass
      Tests run: 4, Failures: 0, Errors: 0, Skipped: 0, Time elapsed: 3.749 sec

      Results :

      Tests run: 4, Failures: 0, Errors: 0, Skipped: 0

      [INFO] ------------------------------------------------------------------------
      [INFO] BUILD SUCCESS
      [INFO] ------------------------------------------------------------------------
      [INFO] Total time: 5.852s
      [INFO] Finished at: Mon Jan 12 12:44:38 IST 2015
      [INFO] Final Memory: 18M/173M
      [INFO] ------------------------------------------------------------------------
      Preparing TestLink client API.
      Using TestLink URL:

      http............/Testlink/lib/api/xmlrpc.php

      FATAL: [Ljava.lang.Object; cannot be cast to java.util.Map
      java.lang.ClassCastException: [Ljava.lang.Object; cannot be cast to java.util.Map
      at br.eti.kinoshita.testlinkjavaapi.util.Util.castToMap(Util.java:591)
      at br.eti.kinoshita.testlinkjavaapi.TestProjectService.getTestProjectByName(TestProjectService.java:115)
      at br.eti.kinoshita.testlinkjavaapi.TestLinkAPI.getTestProjectByName(TestLinkAPI.java:438)
      at hudson.plugins.testlink.TestLinkBuilder.getTestLinkSite(TestLinkBuilder.java:309)
      at hudson.plugins.testlink.TestLinkBuilder.perform(TestLinkBuilder.java:186)
      at hudson.tasks.BuildStepMonitor$1.perform(BuildStepMonitor.java:20)
      at hudson.model.AbstractBuild$AbstractBuildExecution.perform(AbstractBuild.java:770)
      at hudson.model.Build$BuildExecution.build(Build.java:199)
      at hudson.model.Build$BuildExecution.doRun(Build.java:160)
      at hudson.model.AbstractBuild$AbstractBuildExecution.run(AbstractBuild.java:533)
      at hudson.model.Run.execute(Run.java:1759)
      at hudson.model.FreeStyleBuild.run(FreeStyleBuild.java:43)
      at hudson.model.ResourceController.execute(ResourceController.java:89)
      at hudson.model.Executor.run(Executor.java:240)

        Attachments

          Activity

          Hide
          sreelesh sreelesh kunnath added a comment -

          please help me to resolve this situation.

          Show
          sreelesh sreelesh kunnath added a comment - please help me to resolve this situation.
          Hide
          kinow Bruno P. Kinoshita added a comment -

          Hi Sreelesh, that looks like some version incompatibility bug. Unfortunately at the moment I'm working on other projects and haven't had time to release new versions of TestLink plug-in or of testlink-java-api.

          Should you have a pull request for any of them that fixes your issue, please send it in and I'll try to merge/release it.

          Thanks!
          Bruno

          Show
          kinow Bruno P. Kinoshita added a comment - Hi Sreelesh, that looks like some version incompatibility bug. Unfortunately at the moment I'm working on other projects and haven't had time to release new versions of TestLink plug-in or of testlink-java-api. Should you have a pull request for any of them that fixes your issue, please send it in and I'll try to merge/release it. Thanks! Bruno
          Hide
          sreelesh sreelesh kunnath added a comment - - edited

          i have tried with jenkin 1.588 to 1.509 version with test link plugin 3.3 to 3.10 and testlink java api 1.9.7- 1.9.8 etc.
          but nothing working as expected.
          do you have any vedio in youtube to understand the cause of this issue?

          thanks,
          sreelesh kunnath

          Show
          sreelesh sreelesh kunnath added a comment - - edited i have tried with jenkin 1.588 to 1.509 version with test link plugin 3.3 to 3.10 and testlink java api 1.9.7- 1.9.8 etc. but nothing working as expected. do you have any vedio in youtube to understand the cause of this issue? thanks, sreelesh kunnath
          Hide
          sreelesh sreelesh kunnath added a comment -

          Hi Bruno,

          I have tried with testlink 1.9.0 with plugin 2.2 and jenkin 1.536 version
          now i am getting different error

          Error is -Preparing TestLink client API.
          ERROR: Invalid TestLink installation.

          Show
          sreelesh sreelesh kunnath added a comment - Hi Bruno, I have tried with testlink 1.9.0 with plugin 2.2 and jenkin 1.536 version now i am getting different error Error is -Preparing TestLink client API. ERROR: Invalid TestLink installation.
          Hide
          sreelesh sreelesh kunnath added a comment -

          javax.servlet.ServletException: org.apache.commons.jelly.JellyTagException: jar:file:/D:/Applns/Jenkins/plugins/testlink/WEB-INF/lib/classes.jar!/hudson/plugins/testlink/TestLinkProjectAction/nodata.jelly:5:64: <st:include> No page found 'sidepanel.jelly' for class hudson.plugins.testlink.TestLinkProjectAction
          at org.kohsuke.stapler.jelly.JellyFacet$1.dispatch(JellyFacet.java:103)
          at org.kohsuke.stapler.Stapler.tryInvoke(Stapler.java:727)
          at org.kohsuke.stapler.Stapler.invoke(Stapler.java:841)
          at org.kohsuke.stapler.MetaClass$12.dispatch(MetaClass.java:390)
          at org.kohsuke.stapler.Stapler.tryInvoke(Stapler.java:727)
          at org.kohsuke.stapler.Stapler.invoke(Stapler.java:841)
          at org.kohsuke.stapler.MetaClass$6.doDispatch(MetaClass.java:248)
          at org.kohsuke.stapler.NameBasedDispatcher.dispatch(NameBasedDispatcher.java:53)
          at org.kohsuke.stapler.Stapler.tryInvoke(Stapler.java:727)
          at org.kohsuke.stapler.Stapler.invoke(Stapler.java:841)
          at org.kohsuke.stapler.Stapler.invoke(Stapler.java:630)
          at org.kohsuke.stapler.Stapler.service(Stapler.java:224)
          at javax.servlet.http.HttpServlet.service(HttpServlet.java:848)
          at org.eclipse.jetty.servlet.ServletHolder.handle(ServletHolder.java:686)
          at org.eclipse.jetty.servlet.ServletHandler$CachedChain.doFilter(ServletHandler.java:1494)
          at hudson.util.PluginServletFilter$1.doFilter(PluginServletFilter.java:96)
          at hudson.util.PluginServletFilter.doFilter(PluginServletFilter.java:88)
          at org.eclipse.jetty.servlet.ServletHandler$CachedChain.doFilter(ServletHandler.java:1482)
          at hudson.security.csrf.CrumbFilter.doFilter(CrumbFilter.java:48)
          at org.eclipse.jetty.servlet.ServletHandler$CachedChain.doFilter(ServletHandler.java:1482)
          at hudson.security.ChainedServletFilter$1.doFilter(ChainedServletFilter.java:84)
          at hudson.security.ChainedServletFilter.doFilter(ChainedServletFilter.java:76)
          at hudson.security.HudsonFilter.doFilter(HudsonFilter.java:164)
          at org.eclipse.jetty.servlet.ServletHandler$CachedChain.doFilter(ServletHandler.java:1482)
          at org.kohsuke.stapler.compression.CompressionFilter.doFilter(CompressionFilter.java:46)
          at org.eclipse.jetty.servlet.ServletHandler$CachedChain.doFilter(ServletHandler.java:1482)
          at hudson.util.CharacterEncodingFilter.doFilter(CharacterEncodingFilter.java:81)
          at org.eclipse.jetty.servlet.ServletHandler$CachedChain.doFilter(ServletHandler.java:1474)
          at org.eclipse.jetty.servlet.ServletHandler.doHandle(ServletHandler.java:499)
          at org.eclipse.jetty.server.handler.ScopedHandler.handle(ScopedHandler.java:137)
          at org.eclipse.jetty.security.SecurityHandler.handle(SecurityHandler.java:533)
          at org.eclipse.jetty.server.session.SessionHandler.doHandle(SessionHandler.java:231)
          at org.eclipse.jetty.server.handler.ContextHandler.doHandle(ContextHandler.java:1086)
          at org.eclipse.jetty.servlet.ServletHandler.doScope(ServletHandler.java:428)
          at org.eclipse.jetty.server.session.SessionHandler.doScope(SessionHandler.java:193)
          at org.eclipse.jetty.server.handler.ContextHandler.doScope(ContextHandler.java:1020)
          at org.eclipse.jetty.server.handler.ScopedHandler.handle(ScopedHandler.java:135)
          at org.eclipse.jetty.server.handler.HandlerWrapper.handle(HandlerWrapper.java:116)
          at org.eclipse.jetty.server.Server.handle(Server.java:370)
          at org.eclipse.jetty.server.AbstractHttpConnection.handleRequest(AbstractHttpConnection.java:489)
          at org.eclipse.jetty.server.AbstractHttpConnection.headerComplete(AbstractHttpConnection.java:949)
          at org.eclipse.jetty.server.AbstractHttpConnection$RequestHandler.headerComplete(AbstractHttpConnection.java:1011)
          at org.eclipse.jetty.http.HttpParser.parseNext(HttpParser.java:644)
          at org.eclipse.jetty.http.HttpParser.parseAvailable(HttpParser.java:235)
          at org.eclipse.jetty.server.AsyncHttpConnection.handle(AsyncHttpConnection.java:82)
          at org.eclipse.jetty.io.nio.SelectChannelEndPoint.handle(SelectChannelEndPoint.java:668)
          at org.eclipse.jetty.io.nio.SelectChannelEndPoint$1.run(SelectChannelEndPoint.java:52)
          at winstone.BoundedExecutorService$1.run(BoundedExecutorService.java:77)
          at java.util.concurrent.ThreadPoolExecutor.runWorker(Unknown Source)
          at java.util.concurrent.ThreadPoolExecutor$Worker.run(Unknown Source)
          at java.lang.Thread.run(Unknown Source)
          Caused by: org.apache.commons.jelly.JellyTagException: jar:file:/D:/Applns/Jenkins/plugins/testlink/WEB-INF/lib/classes.jar!/hudson/plugins/testlink/TestLinkProjectAction/nodata.jelly:5:64: <st:include> No page found 'sidepanel.jelly' for class hudson.plugins.testlink.TestLinkProjectAction
          at org.kohsuke.stapler.jelly.IncludeTag.doTag(IncludeTag.java:124)
          at org.apache.commons.jelly.impl.TagScript.run(TagScript.java:269)
          at org.apache.commons.jelly.impl.ScriptBlock.run(ScriptBlock.java:95)
          at org.kohsuke.stapler.jelly.CallTagLibScript$1.run(CallTagLibScript.java:99)
          at org.apache.commons.jelly.tags.define.InvokeBodyTag.doTag(InvokeBodyTag.java:91)
          at org.apache.commons.jelly.impl.TagScript.run(TagScript.java:269)
          at org.apache.commons.jelly.impl.ScriptBlock.run(ScriptBlock.java:95)
          at org.kohsuke.stapler.jelly.ReallyStaticTagLibrary$1.run(ReallyStaticTagLibrary.java:99)
          at org.apache.commons.jelly.impl.ScriptBlock.run(ScriptBlock.java:95)
          at org.kohsuke.stapler.jelly.ReallyStaticTagLibrary$1.run(ReallyStaticTagLibrary.java:99)
          at org.apache.commons.jelly.impl.ScriptBlock.run(ScriptBlock.java:95)
          at org.apache.commons.jelly.tags.core.CoreTagLibrary$2.run(CoreTagLibrary.java:105)
          at org.kohsuke.stapler.jelly.CallTagLibScript.run(CallTagLibScript.java:120)
          at org.apache.commons.jelly.tags.core.CoreTagLibrary$2.run(CoreTagLibrary.java:105)
          at org.kohsuke.stapler.jelly.JellyViewScript.run(JellyViewScript.java:81)
          at org.kohsuke.stapler.jelly.DefaultScriptInvoker.invokeScript(DefaultScriptInvoker.java:63)
          at org.kohsuke.stapler.jelly.DefaultScriptInvoker.invokeScript(DefaultScriptInvoker.java:53)
          at org.kohsuke.stapler.jelly.JellyFacet$1.dispatch(JellyFacet.java:95)
          ... 50 more

          please guide me ,why it so?

          Show
          sreelesh sreelesh kunnath added a comment - javax.servlet.ServletException: org.apache.commons.jelly.JellyTagException: jar: file:/D:/Applns/Jenkins/plugins/testlink/WEB-INF/lib/classes.jar!/hudson/plugins/testlink/TestLinkProjectAction/nodata.jelly:5:64: <st:include> No page found 'sidepanel.jelly' for class hudson.plugins.testlink.TestLinkProjectAction at org.kohsuke.stapler.jelly.JellyFacet$1.dispatch(JellyFacet.java:103) at org.kohsuke.stapler.Stapler.tryInvoke(Stapler.java:727) at org.kohsuke.stapler.Stapler.invoke(Stapler.java:841) at org.kohsuke.stapler.MetaClass$12.dispatch(MetaClass.java:390) at org.kohsuke.stapler.Stapler.tryInvoke(Stapler.java:727) at org.kohsuke.stapler.Stapler.invoke(Stapler.java:841) at org.kohsuke.stapler.MetaClass$6.doDispatch(MetaClass.java:248) at org.kohsuke.stapler.NameBasedDispatcher.dispatch(NameBasedDispatcher.java:53) at org.kohsuke.stapler.Stapler.tryInvoke(Stapler.java:727) at org.kohsuke.stapler.Stapler.invoke(Stapler.java:841) at org.kohsuke.stapler.Stapler.invoke(Stapler.java:630) at org.kohsuke.stapler.Stapler.service(Stapler.java:224) at javax.servlet.http.HttpServlet.service(HttpServlet.java:848) at org.eclipse.jetty.servlet.ServletHolder.handle(ServletHolder.java:686) at org.eclipse.jetty.servlet.ServletHandler$CachedChain.doFilter(ServletHandler.java:1494) at hudson.util.PluginServletFilter$1.doFilter(PluginServletFilter.java:96) at hudson.util.PluginServletFilter.doFilter(PluginServletFilter.java:88) at org.eclipse.jetty.servlet.ServletHandler$CachedChain.doFilter(ServletHandler.java:1482) at hudson.security.csrf.CrumbFilter.doFilter(CrumbFilter.java:48) at org.eclipse.jetty.servlet.ServletHandler$CachedChain.doFilter(ServletHandler.java:1482) at hudson.security.ChainedServletFilter$1.doFilter(ChainedServletFilter.java:84) at hudson.security.ChainedServletFilter.doFilter(ChainedServletFilter.java:76) at hudson.security.HudsonFilter.doFilter(HudsonFilter.java:164) at org.eclipse.jetty.servlet.ServletHandler$CachedChain.doFilter(ServletHandler.java:1482) at org.kohsuke.stapler.compression.CompressionFilter.doFilter(CompressionFilter.java:46) at org.eclipse.jetty.servlet.ServletHandler$CachedChain.doFilter(ServletHandler.java:1482) at hudson.util.CharacterEncodingFilter.doFilter(CharacterEncodingFilter.java:81) at org.eclipse.jetty.servlet.ServletHandler$CachedChain.doFilter(ServletHandler.java:1474) at org.eclipse.jetty.servlet.ServletHandler.doHandle(ServletHandler.java:499) at org.eclipse.jetty.server.handler.ScopedHandler.handle(ScopedHandler.java:137) at org.eclipse.jetty.security.SecurityHandler.handle(SecurityHandler.java:533) at org.eclipse.jetty.server.session.SessionHandler.doHandle(SessionHandler.java:231) at org.eclipse.jetty.server.handler.ContextHandler.doHandle(ContextHandler.java:1086) at org.eclipse.jetty.servlet.ServletHandler.doScope(ServletHandler.java:428) at org.eclipse.jetty.server.session.SessionHandler.doScope(SessionHandler.java:193) at org.eclipse.jetty.server.handler.ContextHandler.doScope(ContextHandler.java:1020) at org.eclipse.jetty.server.handler.ScopedHandler.handle(ScopedHandler.java:135) at org.eclipse.jetty.server.handler.HandlerWrapper.handle(HandlerWrapper.java:116) at org.eclipse.jetty.server.Server.handle(Server.java:370) at org.eclipse.jetty.server.AbstractHttpConnection.handleRequest(AbstractHttpConnection.java:489) at org.eclipse.jetty.server.AbstractHttpConnection.headerComplete(AbstractHttpConnection.java:949) at org.eclipse.jetty.server.AbstractHttpConnection$RequestHandler.headerComplete(AbstractHttpConnection.java:1011) at org.eclipse.jetty.http.HttpParser.parseNext(HttpParser.java:644) at org.eclipse.jetty.http.HttpParser.parseAvailable(HttpParser.java:235) at org.eclipse.jetty.server.AsyncHttpConnection.handle(AsyncHttpConnection.java:82) at org.eclipse.jetty.io.nio.SelectChannelEndPoint.handle(SelectChannelEndPoint.java:668) at org.eclipse.jetty.io.nio.SelectChannelEndPoint$1.run(SelectChannelEndPoint.java:52) at winstone.BoundedExecutorService$1.run(BoundedExecutorService.java:77) at java.util.concurrent.ThreadPoolExecutor.runWorker(Unknown Source) at java.util.concurrent.ThreadPoolExecutor$Worker.run(Unknown Source) at java.lang.Thread.run(Unknown Source) Caused by: org.apache.commons.jelly.JellyTagException: jar: file:/D:/Applns/Jenkins/plugins/testlink/WEB-INF/lib/classes.jar!/hudson/plugins/testlink/TestLinkProjectAction/nodata.jelly:5:64: <st:include> No page found 'sidepanel.jelly' for class hudson.plugins.testlink.TestLinkProjectAction at org.kohsuke.stapler.jelly.IncludeTag.doTag(IncludeTag.java:124) at org.apache.commons.jelly.impl.TagScript.run(TagScript.java:269) at org.apache.commons.jelly.impl.ScriptBlock.run(ScriptBlock.java:95) at org.kohsuke.stapler.jelly.CallTagLibScript$1.run(CallTagLibScript.java:99) at org.apache.commons.jelly.tags.define.InvokeBodyTag.doTag(InvokeBodyTag.java:91) at org.apache.commons.jelly.impl.TagScript.run(TagScript.java:269) at org.apache.commons.jelly.impl.ScriptBlock.run(ScriptBlock.java:95) at org.kohsuke.stapler.jelly.ReallyStaticTagLibrary$1.run(ReallyStaticTagLibrary.java:99) at org.apache.commons.jelly.impl.ScriptBlock.run(ScriptBlock.java:95) at org.kohsuke.stapler.jelly.ReallyStaticTagLibrary$1.run(ReallyStaticTagLibrary.java:99) at org.apache.commons.jelly.impl.ScriptBlock.run(ScriptBlock.java:95) at org.apache.commons.jelly.tags.core.CoreTagLibrary$2.run(CoreTagLibrary.java:105) at org.kohsuke.stapler.jelly.CallTagLibScript.run(CallTagLibScript.java:120) at org.apache.commons.jelly.tags.core.CoreTagLibrary$2.run(CoreTagLibrary.java:105) at org.kohsuke.stapler.jelly.JellyViewScript.run(JellyViewScript.java:81) at org.kohsuke.stapler.jelly.DefaultScriptInvoker.invokeScript(DefaultScriptInvoker.java:63) at org.kohsuke.stapler.jelly.DefaultScriptInvoker.invokeScript(DefaultScriptInvoker.java:53) at org.kohsuke.stapler.jelly.JellyFacet$1.dispatch(JellyFacet.java:95) ... 50 more please guide me ,why it so?

            People

            • Assignee:
              kinow Bruno P. Kinoshita
              Reporter:
              sreelesh sreelesh kunnath
            • Votes:
              0 Vote for this issue
              Watchers:
              2 Start watching this issue

              Dates

              • Created:
                Updated: