Uploaded image for project: 'Jenkins'
  1. Jenkins
  2. JENKINS-41470

trigger a build failed with "build job:"

    Details

    • Similar Issues:

      Description

      I triggered a job in pipleline-multibranch job with Jenkinsfile:

      node() {
              properties([[$class: 'ParametersDefinitionProperty', parameterDefinitions: [[$class: 'StringParameterDefinition', defaultValue: '89', description: 'Build parameter', name : 'BUILD_PARAM']]]])
      }
      
      @Library('build_req') import build_req
      build_req()
      

      build_req.groovy:

      def call() {
         node() {
              build job: 'caller', parameters: [[$class: 'StringParameterValue', name: 'BUILD_PARAM', value: 'test']]
          }
      }
      

      I got the following error messages after I built it:
      hudson.remoting.ProxyException: groovy.lang.MissingMethodException: No signature of method: build.call() is applicable for argument types: (java.util.LinkedHashMap) values: [[job:caller, parameters:[[$class:StringParameterValue, name:BUILD_PARAM, ...]]]]
      Possible solutions: call(), call(java.lang.String), wait(), any(), wait(long), main([Ljava.lang.String
      at org.codehaus.groovy.runtime.ScriptBytecodeAdapter.unwrap(ScriptBytecodeAdapter.java:58)
      at org.codehaus.groovy.runtime.ScriptBytecodeAdapter.unwrap(ScriptBytecodeAdapter.java:64)
      at groovy.lang.GroovyObject$invokeMethod$0.call(Unknown Source)
      at org.codehaus.groovy.runtime.callsite.CallSiteArray.defaultCall(CallSiteArray.java:48)
      at org.codehaus.groovy.runtime.callsite.AbstractCallSite.call(AbstractCallSite.java:113)
      at org.kohsuke.groovy.sandbox.impl.Checker$1.call(Checker.java:151)
      at org.kohsuke.groovy.sandbox.GroovyInterceptor.onMethodCall(GroovyInterceptor.java:21)
      at org.jenkinsci.plugins.scriptsecurity.sandbox.groovy.SandboxInterceptor.onMethodCall(SandboxInterceptor.java:115)
      at org.jenkinsci.plugins.scriptsecurity.sandbox.groovy.SandboxInterceptor.onMethodCall(SandboxInterceptor.java:103)
      at org.kohsuke.groovy.sandbox.impl.Checker$1.call(Checker.java:149)
      at org.kohsuke.groovy.sandbox.impl.Checker.checkedCall(Checker.java:146)
      at com.cloudbees.groovy.cps.sandbox.SandboxInvoker.methodCall(SandboxInvoker.java:16)
      at build_req.call(file:/var/lib/jenkins/jobs/test-multibranch-pipeline/branches/controlled%252FModel/builds/11/libs/build_req/vars/build_req.groovy:4)
      at __cps.transform__(Native Method)
      at com.cloudbees.groovy.cps.impl.ContinuationGroup.methodCall(ContinuationGroup.java:57)
      at com.cloudbees.groovy.cps.impl.FunctionCallBlock$ContinuationImpl.dispatchOrArg(FunctionCallBlock.java:109)
      at com.cloudbees.groovy.cps.impl.FunctionCallBlock$ContinuationImpl.fixArg(FunctionCallBlock.java:82)
      at sun.reflect.GeneratedMethodAccessor968.invoke(Unknown Source)
      at sun.reflect.DelegatingMethodAccessorImpl.invoke(DelegatingMethodAccessorImpl.java:43)
      at java.lang.reflect.Method.invoke(Method.java:606)
      at com.cloudbees.groovy.cps.impl.ContinuationPtr$ContinuationImpl.receive(ContinuationPtr.java:72)
      at com.cloudbees.groovy.cps.impl.CollectionLiteralBlock$ContinuationImpl.dispatch(CollectionLiteralBlock.java:55)
      at com.cloudbees.groovy.cps.impl.CollectionLiteralBlock$ContinuationImpl.item(CollectionLiteralBlock.java:45)
      at sun.reflect.GeneratedMethodAccessor967.invoke(Unknown Source)
      at sun.reflect.DelegatingMethodAccessorImpl.invoke(DelegatingMethodAccessorImpl.java:43)
      at java.lang.reflect.Method.invoke(Method.java:606)
      at com.cloudbees.groovy.cps.impl.ContinuationPtr$ContinuationImpl.receive(ContinuationPtr.java:72)
      at com.cloudbees.groovy.cps.impl.CollectionLiteralBlock$ContinuationImpl.dispatch(CollectionLiteralBlock.java:55)
      at com.cloudbees.groovy.cps.impl.CollectionLiteralBlock$ContinuationImpl.item(CollectionLiteralBlock.java:45)
      at sun.reflect.GeneratedMethodAccessor967.invoke(Unknown Source)
      at sun.reflect.DelegatingMethodAccessorImpl.invoke(DelegatingMethodAccessorImpl.java:43)
      at java.lang.reflect.Method.invoke(Method.java:606)
      at com.cloudbees.groovy.cps.impl.ContinuationPtr$ContinuationImpl.receive(ContinuationPtr.java:72)
      at com.cloudbees.groovy.cps.impl.CollectionLiteralBlock$ContinuationImpl.dispatch(CollectionLiteralBlock.java:55)
      at com.cloudbees.groovy.cps.impl.CollectionLiteralBlock$ContinuationImpl.item(CollectionLiteralBlock.java:45)
      at sun.reflect.GeneratedMethodAccessor967.invoke(Unknown Source)
      at sun.reflect.DelegatingMethodAccessorImpl.invoke(DelegatingMethodAccessorImpl.java:43)
      at java.lang.reflect.Method.invoke(Method.java:606)
      at com.cloudbees.groovy.cps.impl.ContinuationPtr$ContinuationImpl.receive(ContinuationPtr.java:72)
      at com.cloudbees.groovy.cps.impl.ConstantBlock.eval(ConstantBlock.java:21)
      at com.cloudbees.groovy.cps.Next.step(Next.java:58)
      at com.cloudbees.groovy.cps.Continuable.run0(Continuable.java:154)
      at org.jenkinsci.plugins.workflow.cps.SandboxContinuable.access$001(SandboxContinuable.java:18)
      at org.jenkinsci.plugins.workflow.cps.SandboxContinuable$1.call(SandboxContinuable.java:33)
      at org.jenkinsci.plugins.workflow.cps.SandboxContinuable$1.call(SandboxContinuable.java:30)
      at org.jenkinsci.plugins.scriptsecurity.sandbox.groovy.GroovySandbox.runInSandbox(GroovySandbox.java:108)
      at org.jenkinsci.plugins.workflow.cps.SandboxContinuable.run0(SandboxContinuable.java:30)
      at org.jenkinsci.plugins.workflow.cps.CpsThread.runNextChunk(CpsThread.java:163)
      at org.jenkinsci.plugins.workflow.cps.CpsThreadGroup.run(CpsThreadGroup.java:328)
      at org.jenkinsci.plugins.workflow.cps.CpsThreadGroup.access$100(CpsThreadGroup.java:80)
      at org.jenkinsci.plugins.workflow.cps.CpsThreadGroup$2.call(CpsThreadGroup.java:240)
      at org.jenkinsci.plugins.workflow.cps.CpsThreadGroup$2.call(CpsThreadGroup.java:228)
      at org.jenkinsci.plugins.workflow.cps.CpsVmExecutorService$2.call(CpsVmExecutorService.java:63)
      at java.util.concurrent.FutureTask.run(FutureTask.java:262)
      at hudson.remoting.SingleLaneExecutorService$1.run(SingleLaneExecutorService.java:112)
      at jenkins.util.ContextResettingExecutorService$1.run(ContextResettingExecutorService.java:28)
      at java.util.concurrent.Executors$RunnableAdapter.call(Executors.java:471)
      at java.util.concurrent.FutureTask.run(FutureTask.java:262)
      at java.util.concurrent.ThreadPoolExecutor.runWorker(ThreadPoolExecutor.java:1145)
      at java.util.concurrent.ThreadPoolExecutor$Worker.run(ThreadPoolExecutor.java:615)
      at java.lang.Thread.run(Thread.java:745)
      Finished: FAILURE

        Attachments

          Activity

          Hide
          ngortheone Ihor Antonov added a comment -

          Hey, Hubert Li, I had the same problem.
          Check your library. Most likely you have build.groovy file under /var that conflicts by name with Pipeline DSL build.
          Just rename it

          Show
          ngortheone Ihor Antonov added a comment - Hey, Hubert Li , I had the same problem. Check your library. Most likely you have build.groovy file under /var that conflicts by name with Pipeline DSL build. Just rename it

            People

            • Assignee:
              vaimr Denis Saponenko
              Reporter:
              hubertli Hubert Li
            • Votes:
              0 Vote for this issue
              Watchers:
              2 Start watching this issue

              Dates

              • Created:
                Updated:
                Resolved: